Peptide,PTM,ModifiedAA,ModifiedPosition,PeptideUniqueToGene,ExperimentDesc,ExpID,PubmedID,ScoreType,IdentScore,LocProb,Log2FChange,PQ-val,QuantSig,PEP,MassErrorPPM
AGRYGSQVMTMTVTNTPSA,nta,A,2,true,"Arabidopsis translation initiation landscape - NTA",167a,35069635,,,,,,,,
AGRYGSQVMTMTVTN,nta,A,2,true,"HUNTER N-terminome: legumain, GluC and trypsin",119,31951383,"MaxQuant score",152.8500000,,,,,,
VSTGDMVSVSR,ph,S,82,true,"Tissue atlas Arabidopsis - ProteomicsDB",114,32188942,"MaxQuant score",89.4300000,0.9280650,,,,0.00045496399980038,
VSTGDMVSVSR,ph,T,83,true,"Tissue atlas Arabidopsis - ProteomicsDB",114,32188942,"MaxQuant score",77.9120000,0.9952840,,,,0.0031552899163216,
KYTNQVLTVGQK,ub,K,131,true,"upl3 mutant / wildtype",168,35926874,"MaxQuant score",107.6500000,1.0000000,-0.7202316,0.3515400,NO,4.0230701415567E-5,1.8671000
ADVEGQDHTNGIER,ph,T,167,true,"Tissue atlas Arabidopsis - ProteomicsDB",114,32188942,"MaxQuant score",177.8400000,1.0000000,,,,4.4482501779156E-21,
EAASSNIFK,ph,S,201,true,"Tissue atlas Arabidopsis - ProteomicsDB",114,32188942,"MaxQuant score",89.8270000,0.9825510,,,,0.0024137101136148,
EAASSNIFK,ph,S,202,true,"Tissue atlas Arabidopsis - ProteomicsDB",114,32188942,"MaxQuant score",88.0560000,0.9251160,,,,0.0026884600520134,
EAASSNIFKHK,ac,K,206,true,"Quantitative Acetylproteomics",101,29440448,,,,,,,,
EAASSNIFKHK,ub,K,206,true,"upl3 mutant / wildtype",168,35926874,"MaxQuant score",62.1660000,1.0000000,-0.1877072,,,0.0014538899995387,-1.1043000
QIGKMLNGKDPK,ub,K,272,true,"Arabidopsis ubiquitination by TUBEs",2,23667124,,,,,,,,
QIGKMLNGKDPK,ub,K,272,true,"Protein ubiquitination during photomorphogenesis",3,28461270,,,,,,,,
QLSMDDLTKPVEEENIK,ph,S,455,true,"Large-scale phosphorylation discovery",44,23111157,XCorr,3.4800000,,,,,,
QLSMDDLTKPVEEENIK,ph,S,455,true,"TOR Kinase and ABA Receptor",100,29290610,XCorr,2.2958179,1.0000000,,,,0.0060999998822808,
QLSMDDLTKPVEEENIK,ph,S,455,true,"Tissue atlas Arabidopsis - ProteomicsDB",114,32188942,"MaxQuant score",354.6400000,1.0000000,,,,0,
SPLVTCLLEGPSGSGK,sno,C,533,true,"Site-specific nitrosomeproteomic id - gsnor1-3",90a,25699590,XCorr,3.3503602,,,,,6.76599995586E-7,-5.2607423
