Peptide,PTM,ModifiedAA,ModifiedPosition,PeptideUniqueToGene,ExperimentDesc,ExpID,PubmedID,ScoreType,IdentScore,LocProb,Log2FChange,PQ-val,QuantSig,PEP,MassErrorPPM
STSDNDLGITGSR,ph,S,19,true,"atm and atr DNA damage response",88,25561503,"MASCOT Score",75.0000000,0.9440000,,,,,0.2200000
STSDNDLGITGSREDDFETK,ph,S,21,true,"srk2dei ABA signaling phopshoproteomics",83,23572148,"MASCOT Score",53.0000000,,,,,,0.0012000
STSDNDLGITGSREDDFETK,ph,S,21,true,"TOR Kinase and ABA Receptor",100,29290610,XCorr,3.3866732,0.7773000,,,,0.00021399999968708,
STSDNDLGITGSR,ph,S,21,true,"LAXIC - mannitol vs control",84b,23660473,XCorr,2.3200000,0.7950000,,,,0.0030224600341171,
STSDNDLGITGSR,ph,S,21,true,"atm and atr DNA damage response",88,25561503,"MASCOT Score",60.0000000,0.9920000,,,,,-2.2200000
STSDNDLGITGSR,ph,S,21,true,"Tissue atlas Arabidopsis - ProteomicsDB",114,32188942,"MaxQuant score",107.5600000,0.9957400,,,,1.9867500977711E-9,
STSDNDLGITGSREDDFETK,ph,S,30,true,"Tissue atlas Arabidopsis - ProteomicsDB",114,32188942,"MaxQuant score",297.7700000,0.9991040,,,,0,
SGTEVTTENPSGEELQDPSQRPNK,ph,S,39,true,"atm and atr DNA damage response",88,25561503,"MASCOT Score",81.0000000,1.0000000,,,,,0.2000000
SGTEVTTENPSGEELQDPSQRPNK,ph,T,41,true,"TOR Kinase and ABA Receptor",100,29290610,XCorr,3.7929349,0.8297000,,,,0.0023179999552667,
SGTEVTTENPSGEELQDPSQRPNKK,ph,S,49,true,"Tissue atlas Arabidopsis - ProteomicsDB",114,32188942,"MaxQuant score",149.8400000,0.9996930,,,,3.9236357001095E-44,
SGTEVTTENPSGEELQDPSQRPNK,ph,S,49,true,"TOR Kinase and ABA Receptor",100,29290610,XCorr,4.2771878,0.9933000,,,,0.0044760000891984,
SGTEVTTENPSGEELQDPSQRPNKK,ph,S,57,true,"Tissue atlas Arabidopsis - ProteomicsDB",114,32188942,"MaxQuant score",88.5950000,0.8521760,,,,8.6521301191286E-13,
AAVSCDVGGGA,sno,C,737,true,"hot5-4 / wildtype, FAT-switch S-nitrosoproteome",169,37277371,,,,,,,,
