Peptide,PTM,ModifiedAA,ModifiedPosition,PeptideUniqueToGene,ExperimentDesc,ExpID,PubmedID,ScoreType,IdentScore,LocProb,Log2FChange,PQ-val,QuantSig,PEP,MassErrorPPM
AASPLVVQKTEEEWR,nt,A,2,true,"N-terminal ChaFRADIC",92,26010716,"MASCOT Score",54.2300000,,,,,6.7759996454697E-5,
AASPLVVQKTEEEWR,nt,A,2,true,"Arg/N-end rule seed, prt6 vs. Wt",99,29168982,"MASCOT Score",59.2800000,,,,,0.00039569998625666,-2.2535524
AASPLVVQKTEEE,nt,A,2,true,"N-terminal ChaFRADIC",92,26010716,"MASCOT Score",38.1300000,,,,,0.003658999921754,
AASPLVVQKTEE,nt,A,2,true,"N-terminal ChaFRADIC",92,26010716,"MASCOT Score",36.2200000,,,,,0.00021830000332557,
AASPLVVQKTEE,nt,A,2,true,"Arg/N-end rule seed, prt6 vs. Wt",99,29168982,"MASCOT Score",35.9400000,,,,,1.0329999895475E-5,-0.6359943
AASPLVVQKTE,nt,A,2,true,"N-terminal ChaFRADIC",92,26010716,"MASCOT Score",47.5300000,,,,,0.00096440000925213,
AASPLVVQKTE,nt,A,2,true,"Arg/N-end rule seed, prt6 vs. Wt",99,29168982,"MASCOT Score",46.7800000,,,,,3.1039999157656E-6,-1.5592518
AASPLVVQKT,nt,A,2,true,"N-term acetylation drought responses",5,26184543,,,,,,,,
AASPLVVQKTEEEWR,nta,A,2,true,"Arg/N-end rule pathway Roots",80,25728785,"MASCOT Score",98.5500000,,,,,1.3680000465754E-9,
AASPLVVQKTEEEWR,nta,A,2,true,"N-terminal ChaFRADIC",92,26010716,"MASCOT Score",54.2300000,,,,,6.7759996454697E-5,
AASPLVVQKTEEEWR,nta,A,2,true,"Arg/N-end rule seed, prt6 vs. Wt",99,29168982,"MASCOT Score",59.2800000,,-0.7323000,0.1018177,NO,0.00039569998625666,-2.2535524
AASPLVVQKTEEEWR,nta,A,2,true,"HUNTER N-terminome: legumain, GluC and trypsin",119,31951383,"MaxQuant score",48.6590000,,,,,,
AASPLVVQKTEEE,nta,A,2,true,"N-terminal ChaFRADIC",92,26010716,"MASCOT Score",38.1300000,,,,,0.003658999921754,
AASPLVVQKTEEE,nta,A,2,true,"HUNTER N-terminome: legumain, GluC and trypsin",119,31951383,"MaxQuant score",91.5490000,,,,,,
AASPLVVQKTEE,nta,A,2,true,"N-terminal ChaFRADIC",92,26010716,"MASCOT Score",36.2200000,,,,,0.00021830000332557,
AASPLVVQKTEE,nta,A,2,true,"Arg/N-end rule seed, prt6 vs. Wt",99,29168982,"MASCOT Score",35.9400000,,-0.1219415,0.5086934,NO,1.0329999895475E-5,-0.6359943
AASPLVVQKTE,nta,A,2,true,"N-terminal ChaFRADIC",92,26010716,"MASCOT Score",47.5300000,,,,,0.00096440000925213,
AASPLVVQKTE,nta,A,2,true,"Arg/N-end rule seed, prt6 vs. Wt",99,29168982,"MASCOT Score",46.7800000,,-0.4469429,0.0027374,NO,3.1039999157656E-6,-1.5592518
AASPLVVQKT,nta,A,2,true,"N-term acetylation drought responses",5,26184543,,,,,,,,
AASPLVVQK,nta,A,2,true,"Characterization plant N-terminal acetylation",6,22223895,"MASCOT Score",59.7000000,,,,,,
ASPLVVQKTEEE,nt,A,3,true,"N-terminal ChaFRADIC",92,26010716,"MASCOT Score",35.8100000,,,,,0.0063129998743534,
ASPLVVQKTEE,nt,A,3,true,"N-terminal ChaFRADIC",92,26010716,"MASCOT Score",40.2200000,,,,,0.091349996626377,
ASPLVVQKTE,nt,A,3,true,"N-terminal ChaFRADIC",92,26010716,"MASCOT Score",43.9400000,,,,,0.017950000241399,
ASPLVVQKTE,nt,A,3,true,"Arg/N-end rule seed, prt6 vs. Wt",99,29168982,"MASCOT Score",36.3500000,,,,,0.020199999213219,-2.1792832
ASPLVVQKTEEEWR,nta,A,3,true,"Arg/N-end rule pathway Roots",80,25728785,"MASCOT Score",39.0800000,,,,,6.427000334952E-5,
ASPLVVQKTEEE,nta,A,3,true,"N-terminal ChaFRADIC",92,26010716,"MASCOT Score",35.8100000,,,,,0.0063129998743534,
ASPLVVQKTEE,nta,A,3,true,"N-terminal ChaFRADIC",92,26010716,"MASCOT Score",40.2200000,,,,,0.091349996626377,
ASPLVVQKTE,nta,A,3,true,"N-terminal ChaFRADIC",92,26010716,"MASCOT Score",43.9400000,,,,,0.017950000241399,
ASPLVVQKTE,nta,A,3,true,"Arg/N-end rule seed, prt6 vs. Wt",99,29168982,"MASCOT Score",36.3500000,,-0.3764677,0.0133837,NO,0.020199999213219,-2.1792832
AASPLVVQK,ph,S,4,true,"atm and atr DNA damage response",88,25561503,"MASCOT Score",27.0000000,1.0000000,,,,,-0.2100000
AASPLVVQK,ph,S,4,true,"Tissue atlas Arabidopsis - ProteomicsDB",114,32188942,"MaxQuant score",112.7500000,1.0000000,,,,0.00012618000619113,
AVLSPEQFR,ph,S,20,false,"atm and atr DNA damage response",88,25561503,"MASCOT Score",41.0000000,1.0000000,,,,,0.7000000
AVLSPEQFR,ph,S,20,false,"TOR Kinase and ABA Receptor",100,29290610,XCorr,2.5452089,1.0000000,,,,0.00029450000147335,
AVLSPEQFR,ph,S,20,false,"Lateral root-induction - NAA vs control",106,23328941,"MASCOT Score",26.0000000,,,,,,
AVLSPEQFR,ph,S,20,false,"Tissue atlas Arabidopsis - ProteomicsDB",114,32188942,"MaxQuant score",162.3600000,1.0000000,,,,0.0001143659974332,
FFEEGIFDCVGCKTPLYK,ph,T,56,true,"Tissue atlas Arabidopsis - ProteomicsDB",114,32188942,"MaxQuant score",121.4700000,0.9999610,,,,5.948509778286E-14,
TPLYKSTTK,ac,K,60,false,"Quantitative Acetylproteomics",101,29440448,,,,,,,,
