Peptide,PTM,ModifiedAA,ModifiedPosition,PeptideUniqueToGene,ExperimentDesc,ExpID,PubmedID,ScoreType,IdentScore,LocProb,Log2FChange,PQ-val,QuantSig,PEP,MassErrorPPM
ADVGIDSRPIGASE,nt,A,53,true,"N-terminal ChaFRADIC",92,26010716,"MASCOT Score",46.2700000,,,,,3.6459998227656E-5,
ADVGIDSRPIGASE,nt,A,53,true,"Stromal N-terminome",96,26371235,"MASCOT Score",74.8200000,,,,,,
ADVGIDSRPIGASE,nt,A,53,true,"HUNTER N-terminome: legumain, GluC and trypsin",119,31951383,"MaxQuant score",123.6400000,,,,,,
ADVGIDSR,nt,A,53,true,"Arg/N-end rule seed, prt6 vs. Wt",99,29168982,"MASCOT Score",46.3900000,,0.2712967,0.1310012,NO,0.21789999306202,-0.6694460
ADVGIDSR,nta,A,53,true,"Arg/N-end rule seed, prt6 vs. Wt",99,29168982,"MASCOT Score",46.3900000,,,,,0.21789999306202,-0.6694460
LQQYFQNLDYDKK,ac,K,92,true,"Histone deacetylases substrates - hda14 vs WT",98e,29061669,"MaxQuant Score",56.6000000,1.0000000,-1.0520000,0.3572728,NO,0.0020000000949949,
SGVIFCSISEAIR,so,C,228,false,"Arabidopsis S-sulfenylation chemoproteomics",108,31578252,"pFind PSM Score",0.0179958,,0.9523800,,,,-0.0277802
GGIYNFVTKR,ac,K,365,true,"Quantitative Acetylproteomics",101,29440448,,,,,,,,
GLCAGDR,sno,C,369,false,"hot5-4 / wildtype, FAT-switch S-nitrosoproteome",169,37277371,,,,,,,,
ALAAMISGFCR,ox,C,529,false,"SPEAR - 50 mM H2O2 / mock",138b,34619326,,,,1.9757547,0.0207064,YES,,
