Peptide,PTM,ModifiedAA,ModifiedPosition,PeptideUniqueToGene,ExperimentDesc,ExpID,PubmedID,ScoreType,IdentScore,LocProb,Log2FChange,PQ-val,QuantSig,PEP,MassErrorPPM
ASSVSPLQASLR,ph,S,47,true,"Tissue atlas Arabidopsis - ProteomicsDB",114,32188942,"MaxQuant score",181.6700000,0.9999410,,,,9.7645802029135E-20,
DRIDSVKNTQK,ac,K,64,true,"Histone deacetylases - hda14 vs WT (thylakoids)",98d,29061669,"MaxQuant Score",67.4000000,1.0000000,0.1520000,0.9078205,NO,0.00089999998454005,
DRIDSVKNTQK,ac,K,64,true,"Quantitative Acetylproteomics",101,29440448,,,,,,,,
IDSVKNTQK,ac,K,64,false,"Quantitative Acetylproteomics",101,29440448,,,,,,,,
GLCGGFNNFIIK,ox,C,139,true,"SPEAR - 10 mM H2O2 / mock",138a,34619326,,,,2.4601091,0.0006292,YES,,
GLCGGFNNFIIKK,ac,K,148,true,"Histone deacetylases - apicidin vs control",98a,29061669,"MaxQuant Score",160.5000000,1.0000000,0.1710000,0.3689776,NO,7.8999997492976E-21,
GLCGGFNNFIIKK,ac,K,148,true,"Histone deacetylases substrates - TSA vs control",98b,29061669,"MaxQuant Score",160.5000000,1.0000000,0.0780000,0.9977001,NO,7.8999997492976E-21,
GLCGGFNNFIIKK,ac,K,148,true,"Histone deacetylases - hda14 vs WT (thylakoids)",98d,29061669,"MaxQuant Score",182.4000000,1.0000000,0.0570000,0.9862795,NO,7.1800002033243E-28,
GLCGGFNNFIIKK,ac,K,148,true,"Histone deacetylases substrates - hda14 vs WT",98e,29061669,"MaxQuant Score",49.4000000,1.0000000,0.1190000,0.9120108,NO,0.0040000001899898,
ELKGLGLEYTVISVGK,ac,K,158,true,"Histone deacetylases- hda14 vs WT (low light)",98c,29061669,"MaxQuant Score",175.3900000,1.0000000,0.0550000,0.9931160,NO,2.999999947355E-14,
ELKGLGLEYTVISVGK,ac,K,158,true,"Histone deacetylases - hda14 vs WT (thylakoids)",98d,29061669,"MaxQuant Score",182.2000000,1.0000000,-0.0070000,0.9977001,NO,8.0700000556832E-31,
KGNSYFLR,ph,S,175,true,"atm and atr DNA damage response",88,25561503,"MASCOT Score",27.0000000,1.0000000,,,,,-0.9900000
RPYIPVDKYLEAGTLPTAK,ac,K,187,true,"Histone deacetylases - apicidin vs control",98a,29061669,"MaxQuant Score",74.0000000,1.0000000,0.1080000,0.5011872,NO,1.5999999719227E-13,
RPYIPVDKYLEAGTLPTAK,ac,K,187,true,"Histone deacetylases substrates - TSA vs control",98b,29061669,"MaxQuant Score",74.0000000,1.0000000,-0.0530000,0.9977001,NO,1.5999999719227E-13,
RPYIPVDKYLEAGTLPTAK,ac,K,187,true,"Histone deacetylases substrates - hda14 vs WT",98e,29061669,"MaxQuant Score",90.7000000,1.0000000,0.1440000,0.8629785,NO,2.6000000763471E-12,
YLEAGTLPTAK,ph,T,193,true,"Tissue atlas Arabidopsis - ProteomicsDB",114,32188942,"MaxQuant score",113.7700000,0.9950540,,,,8.4529703599401E-5,
SEPVIHTLLPLSPK,ph,S,243,true,"Large-scale phosphorylation discovery",44,23111157,XCorr,4.0090000,,,,,,
SEPVIHTLLPLSPK,ph,S,243,true,"atm and atr DNA damage response",88,25561503,"MASCOT Score",37.0000000,1.0000000,,,,,-1.1800000
SEPVIHTLLPLSPK,ph,S,243,true,"TOR Kinase and ABA Receptor",100,29290610,XCorr,2.7896962,1.0000000,,,,2.4850000045262E-5,
SEPVIHTLLPLSPK,ph,S,243,true,"Tissue atlas Arabidopsis - ProteomicsDB",114,32188942,"MaxQuant score",244.5600000,1.0000000,,,,0,
GEICDINGTCVDAAEDEFFR,ng,N,252,true,"Conserved N-glycosylation",74,22633491,"MaxQuant Score",153.9600000,1.0000000,,,,5.1550001121745E-36,0.2550000
MSAMSSASDNASDLKK,ac,K,343,true,"Histone deacetylases - hda14 vs WT (thylakoids)",98d,29061669,"MaxQuant Score",113.5000000,1.0000000,0.0320000,0.9954054,NO,2.7300000038366E-9,
MSAMSSASDNASDLKK,ac,K,343,true,"Quantitative Acetylproteomics",101,29440448,,,,,,,,
SLSMVYNRK,ph,S,347,true,"STN8 phosphoproteome",38,21768351,"MASCOT Score",40.6000000,,,,,,
SLSMVYNRK,ph,S,347,true,"Chloroplast kinase substrates",60,19376835,"MASCOT Score",36.2400000,,,,,,0.9506690
SLSMVYNR,ph,S,347,true,"STN8 phosphoproteome",38,21768351,"MASCOT Score",46.3300000,,,,,,
SLSMVYNR,ph,S,347,true,"Chloroplast kinase substrates",60,19376835,"MASCOT Score",43.2000000,,,,,,-1.9760700
SLSMVYNR,ph,S,347,true,"atm and atr DNA damage response",88,25561503,"MASCOT Score",37.0000000,1.0000000,,,,,-0.2600000
SLSMVYNR,ph,S,347,true,"Tissue atlas Arabidopsis - ProteomicsDB",114,32188942,"MaxQuant score",109.2900000,0.9999820,,,,0.001124529982917,
SLSMVYNRK,mox,M,348,true,"cat2 Methionine oxidation - 1h stress",62a,25693801,"MASCOT Score",46.0000000,,0.2336729,,NO,,
QAKITGEILEIVAGANAQV,nt,Q,355,true,"HUNTER N-terminome: legumain, GluC and trypsin",119,31951383,"MaxQuant score",,,,,,,
