Peptide,PTM,ModifiedAA,ModifiedPosition,PeptideUniqueToGene,ExperimentDesc,ExpID,PubmedID,ScoreType,IdentScore,LocProb,Log2FChange,PQ-val,QuantSig,PEP,MassErrorPPM
SSPASGGGFAGR,ph,S,50,true,"atm and atr DNA damage response",88,25561503,"MASCOT Score",43.0000000,0.9940000,,,,,-2.0200000
NVTSSDIDK,ng,N,138,false,"Conserved N-glycosylation",74,22633491,"MaxQuant Score",67.9600000,1.0000000,,,,0.018999999389052,1.2240000
LGCLGLCGQK,acy,C,281,true,"Arabidopsis S-acylation atlas - Hypocotyl",163b,35681017,,,,,,,,
LGCLGLCGQK,acy,C,281,true,"Arabidopsis S-acylation atlas - Leaf",163c,35681017,,,,,,,,
LGCLGLCGQK,acy,C,281,true,"Arabidopsis S-acylation atlas - Seedling",163d,35681017,,,,,,,,
LGCLGLCGQK,acy,C,281,true,"Arabidopsis S-acylation atlas - Silique",163e,35681017,,,,,,,,
LGCLGLCGQK,acy,C,281,true,"Arabidopsis S-acylation atlas - Stem",163f,35681017,,,,,,,,
LGCLGLCGQK,acy,C,285,true,"Arabidopsis S-acylation atlas - Hypocotyl",163b,35681017,,,,,,,,
LGCLGLCGQK,acy,C,285,true,"Arabidopsis S-acylation atlas - Leaf",163c,35681017,,,,,,,,
LGCLGLCGQK,acy,C,285,true,"Arabidopsis S-acylation atlas - Seedling",163d,35681017,,,,,,,,
LGCLGLCGQK,acy,C,285,true,"Arabidopsis S-acylation atlas - Silique",163e,35681017,,,,,,,,
LGCLGLCGQK,acy,C,285,true,"Arabidopsis S-acylation atlas - Stem",163f,35681017,,,,,,,,
AREPNLNLKGYLQDAYIHPVFK,ub,K,706,true,"Ubiquitination Membrane Proteins",120,33585938,,,,,,,,
EPNLNLKGYLQDAYIHPVFK,ub,K,706,true,"upl3 mutant / wildtype",168,35926874,"MaxQuant score",94.6710000,1.0000000,-0.1062495,0.8596400,NO,5.6114899393833E-8,0.4204300
RNTPAPSRISGESSPSLAVINGK,ph,T,750,true,"Tissue atlas Arabidopsis - ProteomicsDB",114,32188942,"MaxQuant score",78.3000000,0.9995350,,,,1.7372700256146E-7,
ISGESSPSLAVINGK,ph,S,757,true,"STN8 phosphoproteome",38,21768351,"MASCOT Score",74.8700000,,,,,,-0.8990940
ISGESSPSLAVINGK,ph,S,757,true,"atm and atr DNA damage response",88,25561503,"MASCOT Score",69.0000000,1.0000000,,,,,-0.1400000
ISGESSPSLAVINGK,ph,S,757,true,"Tissue atlas Arabidopsis - ProteomicsDB",114,32188942,"MaxQuant score",307.3100000,0.9999990,,,,0,
NTPAPSRISGESSPSLAVINGK,ph,S,760,true,"Tissue atlas Arabidopsis - ProteomicsDB",114,32188942,"MaxQuant score",189.8000000,0.7534430,,,,0,
ISGESSPSLAVINGK,ph,S,760,true,"atm and atr DNA damage response",88,25561503,"MASCOT Score",36.0000000,0.9920000,,,,,-0.2100000
ISGESSPSLAVINGK,ph,S,761,true,"TOR Kinase and ABA Receptor",100,29290610,XCorr,3.6207922,0.9826000,,,,0.0010019999463111,
ISGESSPSLAVINGK,ph,S,761,true,"Tissue atlas Arabidopsis - ProteomicsDB",114,32188942,"MaxQuant score",324.0400000,0.9994940,,,,0,
ISGESSPSLAVINGKEV,ub,K,770,true,"Ubiquitination Membrane Proteins",120,33585938,,,,,,,,
