Peptide,PTM,ModifiedAA,ModifiedPosition,PeptideUniqueToGene,ExperimentDesc,ExpID,PubmedID,ScoreType,IdentScore,LocProb,Log2FChange,PQ-val,QuantSig,PEP,MassErrorPPM
ASSSLSPATQLGSSR,nta,A,2,true,"FtsH12 N-terminome: WT / FtsH12 knockdown miRNA",118,33216923,"MaxQuant score",88.5960000,,,,,0.0054224999621511,
QASSIPADRVPDME,nt,Q,50,true,"N-terminal ChaFRADIC",92,26010716,"MASCOT Score",29.1300000,,,,,1.987999951325E-7,
QASSIPADRVPDME,nt,Q,50,true,"HUNTER N-terminome: legumain, GluC and trypsin",119,31951383,"MaxQuant score",148.1800000,,,,,,
ASSIPADRVPDMEKRKTLN,nt,A,51,true,"HUNTER N-terminome: legumain, GluC and trypsin",119,31951383,"MaxQuant score",121.2600000,,,,,,
ASSIPADRVPDMEKR,nt,A,51,true,"N-terminal ChaFRADIC",92,26010716,"MASCOT Score",48.7100000,,,,,1.0909999446085E-6,
ASSIPADRVPDMEKR,nt,A,51,true,"FtsH12 N-terminome: WT / FtsH12 knockdown miRNA",118,33216923,"MaxQuant score",68.3750000,,,,,1.0799999472511E-6,
ASSIPADRVPDMEKR,nt,A,51,true,"HUNTER N-terminome: legumain, GluC and trypsin",119,31951383,"MaxQuant score",153.2400000,,,,,,
ASSIPADRVPDME,nt,A,51,true,"N-terminal ChaFRADIC",92,26010716,"MASCOT Score",45.5500000,,,,,0.0038199999835342,
ASSIPADRVPDME,nt,A,51,true,"Arg/N-end rule seed, prt6 vs. Wt",99,29168982,"MASCOT Score",34.9000000,,0.0947755,0.6744458,NO,2.2160000298754E-5,0.5640261
ASSIPADRVPDME,nt,A,51,true,"HUNTER N-terminome: legumain, GluC and trypsin",119,31951383,"MaxQuant score",190.5300000,,,,,,
ASSIPADRVPD,nt,A,51,true,"HUNTER N-terminome: legumain, GluC and trypsin",119,31951383,"MaxQuant score",121.6000000,,,,,,
ASSIPADR,nt,A,51,true,"N-terminal ChaFRADIC",92,26010716,"MASCOT Score",39.4700000,,,,,0.049949999898672,
ASSIPADR,nt,A,51,true,"Arg/N-end rule seed, prt6 vs. Wt",99,29168982,"MASCOT Score",63.2000000,,0.0268531,0.9005154,NO,0.065339997410774,-0.6983240
ASSIPADRVPDMEKR,nta,A,51,true,"N-terminal ChaFRADIC",92,26010716,"MASCOT Score",36.9000000,,,,,0.00031649999436922,
ASSIPADRVPDMEKR,nta,A,51,true,"HUNTER N-terminome: legumain, GluC and trypsin",119,31951383,"MaxQuant score",44.1960000,,,,,,
ASSIPADRVPDME,nta,A,51,true,"N-terminal ChaFRADIC",92,26010716,"MASCOT Score",45.5500000,,,,,0.0038199999835342,
ASSIPADRVPDME,nta,A,51,true,"HUNTER N-terminome: legumain, GluC and trypsin",119,31951383,"MaxQuant score",128.3600000,,,,,,
ASSIPADRVPD,nta,A,51,true,"HUNTER N-terminome: legumain, GluC and trypsin",119,31951383,"MaxQuant score",104.2200000,,,,,,
ASSIPADR,nta,A,51,true,"N-terminal ChaFRADIC",92,26010716,"MASCOT Score",39.4700000,,,,,0.049949999898672,
ASSIPADR,nta,A,51,true,"Arg/N-end rule seed, prt6 vs. Wt",99,29168982,"MASCOT Score",63.2000000,,,,,0.065339997410774,-0.6983240
SSIPADRVPDME,nt,S,52,true,"N-terminal ChaFRADIC",92,26010716,"MASCOT Score",31.2700000,,,,,0.0097749996930361,
SSIPADRVPDME,nt,S,52,true,"HUNTER N-terminome: legumain, GluC and trypsin",119,31951383,"MaxQuant score",100.7200000,,,,,,
SSIPADRVPDME,nta,S,52,true,"N-terminal ChaFRADIC",92,26010716,"MASCOT Score",25.0800000,,,,,0.0085110003128648,
SIPADRVPDME,nt,S,53,true,"N-terminal ChaFRADIC",92,26010716,"MASCOT Score",23.8400000,,,,,0.044089999049902,
VPDMEKR,ac,K,64,true,"Quantitative Acetylproteomics",101,29440448,,,,,,,,
TFFVPPGTGGGGGGTPAKD,nt,T,89,true,"N-terminal ChaFRADIC",92,26010716,"MASCOT Score",38.1800000,,,,,0.00030610000248998,
TFFVPPGTGGGGGGTPAKD,nta,T,89,true,"N-terminal ChaFRADIC",92,26010716,"MASCOT Score",38.1800000,,,,,0.00030610000248998,
ALGNDVVAAE,nt,A,108,true,"N-terminal ChaFRADIC",92,26010716,"MASCOT Score",81.7900000,,,,,6.8080000346527E-5,
DALGNDVVAAEWLKTHGPGDR,ac,K,120,true,"Histone deacetylases substrates - TSA vs control",98b,29061669,"MaxQuant Score",117.4000000,1.0000000,0.1160000,0.9977001,NO,0,
DALGNDVVAAEWLKTHGPGDR,ac,K,120,true,"Histone deacetylases- hda14 vs WT (low light)",98c,29061669,"MaxQuant Score",100.6200000,1.0000000,0.1180000,0.9885531,NO,1.3000000080865E-6,
DALGNDVVAAEWLKTHGPGDR,ac,K,120,true,"Histone deacetylases - hda14 vs WT (thylakoids)",98d,29061669,"MaxQuant Score",123.1000000,1.0000000,0.2530000,0.8994976,NO,1.4299999546197E-20,
DALGNDVVAAEWLKTHGPGDR,ac,K,120,true,"Quantitative Acetylproteomics",101,29440448,,,,,,,,
PTYLVVE,nt,P,137,true,"N-terminal ChaFRADIC",92,26010716,"MASCOT Score",36.9200000,,,,,0.019239999353886,
AENKFLCPCHGSQYNAQGR,ac,K,172,true,"Histone deacetylases substrates - TSA vs control",98b,29061669,"MaxQuant Score",47.1000000,1.0000000,0.1390000,0.9977001,NO,0.00022000000171829,
FLCPCHGSQYNAQGR,sno,C,177,true,"hot5-4 / wildtype, FAT-switch S-nitrosoproteome",169,37277371,,,,-0.4306638,0.0691004,NO,,
GPAPLSLALAHADIDEAGK,ph,S,196,true,"Tissue atlas Arabidopsis - ProteomicsDB",114,32188942,"MaxQuant score",108.6400000,1.0000000,,,,1.2996399789689E-10,
