Peptide,PTM,ModifiedAA,ModifiedPosition,PeptideUniqueToGene,ExperimentDesc,ExpID,PubmedID,ScoreType,IdentScore,LocProb,Log2FChange,PQ-val,QuantSig,PEP,MassErrorPPM
LAQSILSLTITPEFVGATVTIASTSR,ph,S,258,true,"Large-scale phosphorylation discovery",44,23111157,XCorr,4.1630000,,,,,,
LAQSILSLTITPEFVGATVTIASTSR,ph,T,274,true,"Large-scale phosphorylation discovery",44,23111157,XCorr,4.1630000,,,,,,
TVASEVLK,ph,S,318,true,"Tissue atlas Arabidopsis - ProteomicsDB",114,32188942,"MaxQuant score",68.4560000,0.9957880,,,,0.017356399446726,
LKELLNLNNEEASEDCDVR,ph,S,608,true,"Tissue atlas Arabidopsis - ProteomicsDB",114,32188942,"MaxQuant score",447.7500000,1.0000000,,,,0,
QGVNEEIDTVER,ph,T,630,true,"Tissue atlas Arabidopsis - ProteomicsDB",114,32188942,"MaxQuant score",84.4680000,1.0000000,,,,0.0018307199934497,
LKESDADASNLETSGSDTSSNR,ph,S,637,true,"Tissue atlas Arabidopsis - ProteomicsDB",114,32188942,"MaxQuant score",78.7050000,0.9991530,,,,3.2672699035174E-6,
LKESDADASNLETSGSDTSSNR,ph,S,642,true,"Tissue atlas Arabidopsis - ProteomicsDB",114,32188942,"MaxQuant score",62.2910000,0.9290320,,,,2.1460200514412E-5,
EDEKSETFLVFEK,ph,S,687,true,"Tissue atlas Arabidopsis - ProteomicsDB",114,32188942,"MaxQuant score",247.4400000,0.9999740,,,,0,
ALAEEPDLQRNSASR,ph,S,727,true,"Tissue atlas Arabidopsis - ProteomicsDB",114,32188942,"MaxQuant score",78.7030000,0.9563260,,,,8.5845902503934E-5,
GSEVITSSQLK,ph,S,748,true,"Tissue atlas Arabidopsis - ProteomicsDB",114,32188942,"MaxQuant score",174.2900000,0.9907940,,,,6.4631099951085E-12,
QTGPAHDNNSSGDLPESPGDENTWQQKPSTPIK,ph,S,783,true,"Phospho cell culture sucrose/TOR",109,30833711,,,0.9366040,,,,,
QTGPAHDNNSSGDLPESPGDENTWQQKPSTPIK,ph,S,783,true,"Tissue atlas Arabidopsis - ProteomicsDB",114,32188942,"MaxQuant score",154.7500000,0.9997120,,,,0,
DQTVTETPKTGENLMRTSSSSEEGIK,ph,T,816,true,"Large-scale phosphorylation discovery",44,23111157,XCorr,4.0160000,,,,,,
TSSSSEEGIKQGQQVR,ph,S,818,true,"Tissue atlas Arabidopsis - ProteomicsDB",114,32188942,"MaxQuant score",110.7400000,0.9570280,,,,6.2443596959838E-8,
TSSSSEEGIK,ph,S,818,true,"atm and atr DNA damage response",88,25561503,"MASCOT Score",58.0000000,0.9570000,,,,,-1.7400000
