Peptide,PTM,ModifiedAA,ModifiedPosition,PeptideUniqueToGene,ExperimentDesc,ExpID,PubmedID,ScoreType,IdentScore,LocProb,Log2FChange,PQ-val,QuantSig,PEP,MassErrorPPM
GSKPWLHPAPQ,nt,G,2,true,"Arg/N-end rule seed, prt6 vs. Wt",99,29168982,"MASCOT Score",20.1800000,,,,,0.047180000692606,2.5211361
GSKPWLHPAPQYKTLETFWDDEDDAPGPR,nta,G,2,true,"HUNTER N-terminome: legumain, GluC and trypsin",119,31951383,"MaxQuant score",48.1240000,,,,,,
GSKPWLHPAPQ,nta,G,2,true,"Arg/N-end rule seed, prt6 vs. Wt",99,29168982,"MASCOT Score",20.1800000,,0.1513549,0.3946716,NO,0.047180000692606,2.5211361
LKPAGEPPSPR,ph,S,97,true,"atm and atr DNA damage response",88,25561503,"MASCOT Score",37.0000000,1.0000000,,,,,-1.1700000
LKPAGEPPSPR,ph,S,97,true,"Tissue atlas Arabidopsis - ProteomicsDB",114,32188942,"MaxQuant score",70.2810000,1.0000000,,,,0.00081748102093115,
ETVGSLGGMVR,ph,S,482,true,"Tissue atlas Arabidopsis - ProteomicsDB",114,32188942,"MaxQuant score",100.3100000,0.9999760,,,,8.2864797150251E-5,
QLSLDQFQNESR,nt,Q,489,true,"HUNTER N-terminome: legumain, GluC and trypsin",119,31951383,"MaxQuant score",127.3700000,,,,,,
QLSLDQFQNESRR,ph,S,491,true,"Chloroplast kinase substrates",60,19376835,"MASCOT Score",38.9400000,,,,,,1.7630400
QLSLDQFQNESRR,ph,S,491,true,"srk2dei ABA signaling phopshoproteomics",83,23572148,"MASCOT Score",49.0000000,,,,,,-0.0007000
QLSLDQFQNESRR,ph,S,491,true,"atm and atr DNA damage response",88,25561503,"MASCOT Score",33.0000000,1.0000000,,,,,-0.8100000
QLSLDQFQNESRR,ph,S,491,true,"Brassinosteroid-Regulated Phosphorylation Dynamics",94,26187819,"MaxQuant Score",140.2200000,1.0000000,,,,3.2520001695957E-5,-2.0630000
QLSLDQFQNESRR,ph,S,491,true,"Tissue atlas Arabidopsis - ProteomicsDB",114,32188942,"MaxQuant score",354.0800000,1.0000000,,,,0,
QLSLDQFQNESR,ph,S,491,true,"Arabidopsis root NAA phosphoproteome",18a,27643528,"MaxQuant Score",74.2960000,1.0000000,,,,1.6010000081224E-6,0.7590000
QLSLDQFQNESR,ph,S,491,true,"Phosphorylation Early Elicitor Signaling",23,17317660,,,,,,,,
QLSLDQFQNESR,ph,S,491,true,"Phosphorylation nuclei-enriched fractions",28,19245862,,,,,,,,
QLSLDQFQNESR,ph,S,491,true,"STN8 phosphoproteome",38,21768351,"MASCOT Score",48.4200000,,,,,,-0.7669000
QLSLDQFQNESR,ph,S,491,true,"PAMP-triggered phosphorylation",48,24601666,"MASCOT Score",43.6700000,,,,,,
QLSLDQFQNESR,ph,S,491,true,"Tyrosine phosphorylation in Arabidopsis",59,18463617,"MASCOT Score",71.0000000,,,,,,0.4534655
QLSLDQFQNESR,ph,S,491,true,"Chloroplast kinase substrates",60,19376835,"MASCOT Score",70.7500000,,,,,,-1.0903800
QLSLDQFQNESR,ph,S,491,true,"srk2dei ABA signaling phopshoproteomics",83,23572148,"MASCOT Score",81.0000000,,,,,,-0.0004000
QLSLDQFQNESR,ph,S,491,true,"LAXIC - ABA stress",84a,23660473,XCorr,3.4300000,1.0000000,,,,0.00010233499779133,
QLSLDQFQNESR,ph,S,491,true,"LAXIC - mannitol vs control",84b,23660473,XCorr,3.4100000,1.0000000,,,,1.5399999711008E-6,
QLSLDQFQNESR,ph,S,491,true,"SnRK2 protein kinase substrates",85,23776212,XCorr,3.3802741,1.0000000,,,,0.010898100212216,
QLSLDQFQNESR,ph,S,491,true,"atm and atr DNA damage response",88,25561503,"MASCOT Score",65.0000000,1.0000000,,,,,0.0600000
QLSLDQFQNESR,ph,S,491,true,"TOR Kinase and ABA Receptor",100,29290610,XCorr,3.7080956,1.0000000,,,,2.9869999707444E-5,
QLSLDQFQNESR,ph,S,491,true,"Lateral root-induction - NAA vs control",106,23328941,"MASCOT Score",47.0000000,,0.6049132,0.0155542,YES,,
QLSLDQFQNESR,ph,S,491,true,"Phospho cell culture sucrose/TOR",109,30833711,,,1.0000000,,,,,
QLSLDQFQNESR,ph,S,491,true,"Col-0 callus - FC Col-0 vs. Col-0 Xray",111a,31410901,,63.7800000,,0.8318639,0.0000000,NO,,0.9619375
QLSLDQFQNESR,ph,S,491,true,"Col-0 X-ray callus - FC Col-0 vs. Col-0 Xray",111b,31410901,,63.7800000,,0.8318639,0.0000000,NO,,0.9619375
QLSLDQFQNESR,ph,S,491,true,"atm callus - FC atm vs. atm Xray",111c,31410901,,63.7800000,,0.4821597,0.0000000,NO,,0.9619375
QLSLDQFQNESR,ph,S,491,true,"atm-3 X-ray callus - FC atm vs. atm Xray",111d,31410901,,63.7800000,,0.4821597,0.0000000,NO,,0.9619375
QLSLDQFQNESRR,ph,S,499,true,"atm and atr DNA damage response",88,25561503,"MASCOT Score",33.0000000,1.0000000,,,,,-0.8100000
QLSLDQFQNESR,ph,S,499,true,"atm and atr DNA damage response",88,25561503,"MASCOT Score",35.0000000,1.0000000,,,,,-0.8500000
QLSLDQFQNESR,ph,S,499,true,"Tissue atlas Arabidopsis - ProteomicsDB",114,32188942,"MaxQuant score",168.5500000,1.0000000,,,,9.991210163623E-15,
QKSPQGLHK,ph,S,522,true,"atm and atr DNA damage response",88,25561503,"MASCOT Score",29.0000000,1.0000000,,,,,-2.7700000
QKSPQGLHK,ph,S,522,true,"Tissue atlas Arabidopsis - ProteomicsDB",114,32188942,"MaxQuant score",54.2700000,1.0000000,,,,0.011404000222683,
IICMHGGIGR,ox,C,701,false,"SPEAR - 10 mM H2O2 / mock",138a,34619326,,,,0.5764363,0.0357587,YES,,
IICMHGGIGR,so,C,701,false,"Arabidopsis S-sulfenylation chemoproteomics",108,31578252,"pFind PSM Score",0.2391440,,1.0638300,,,,-1.7515753
SISTVEQIEK,ph,S,711,true,"Tissue atlas Arabidopsis - ProteomicsDB",114,32188942,"MaxQuant score",144.5700000,0.9916120,,,,6.5562102236072E-7,
AHECVMDGFER,ox,C,784,false,"SPEAR - 10 mM H2O2 / mock",138a,34619326,,,,-2.5143778,0.0129019,YES,,
AHECVMDGFER,ox,C,784,false,"SPEAR - 50 mM H2O2 / mock",138b,34619326,,,,-2.3218270,0.0042787,YES,,
AHECVMDGFER,sno,C,784,false,"Site-specific nitrosomeproteomic id - gsnor1-3",90a,25699590,XCorr,2.9399581,,,,,1.4719999853696E-5,-6.1218137
AHECVMDGFER,sno,C,784,false,"Site-specific nitrosomeproteomic id - gsnor1-3",90b,25699590,XCorr,3.2400000,,,,,0.05502999946475,-6.5400000
AHECVMDGFER,so,C,784,false,"Arabidopsis S-sulfenylation chemoproteomics",108,31578252,"pFind PSM Score",0.2020260,,,,,,-1.1160374
AHECVMDGFER,so,C,784,false,"S-sulfenylation site detection using YAP1C",110,32714340,,,,,,,,
LIHPLPPPILSPENSPEHSGDDAWMQELNIQRPPTPTR,ph,S,839,true,"TOR Kinase and ABA Receptor",100,29290610,XCorr,4.2666483,0.8721000,,,,0.001704000052996,
LIHPLPPPILSPENSPEHSGDDAWMQELNIQRPPTPTR,ph,S,843,true,"TOR Kinase and ABA Receptor",100,29290610,XCorr,4.2666483,0.8721000,,,,0.001704000052996,
LIHPLPPPILSPENSPEHSGDDAWMQELNIQRPPTPTR,ph,T,863,true,"TOR Kinase and ABA Receptor",100,29290610,XCorr,4.3685675,0.7827000,,,,6.0150000535941E-7,
LIHPLPPPILSPENSPEHSGDDAWMQELNIQRPPTPTR,ph,T,863,true,"Tissue atlas Arabidopsis - ProteomicsDB",114,32188942,"MaxQuant score",338.2400000,0.9812860,,,,0,
