Peptide,PTM,ModifiedAA,ModifiedPosition,PeptideUniqueToGene,ExperimentDesc,ExpID,PubmedID,ScoreType,IdentScore,LocProb,Log2FChange,PQ-val,QuantSig,PEP,MassErrorPPM
VLAEEGKAK,ac,K,96,true,"Quantitative Acetylproteomics",101,29440448,,,,,,,,
AIAFDEIDKAPEEKKR,nt,A,99,true,"Metacaspase9 substrates - Col-0 / mc9",51a,23964026,"MASCOT Score",87.0000000,,3.3584840,,NO,,-2.2271665
AIAFDEIDKAPEEKKR,nt,A,99,true,"Metacaspase9 substrates - 35S:MC9 / mc9",51b,23964026,"MASCOT Score",52.0000000,,3.3993889,,NO,,-1.9487713
AIAFDEIDKAPEEKKR,nt,A,99,true,"Metacaspase9 substrates - in vitro rMC9",51c,23964026,"MASCOT Score",65.0000000,,2.7584975,,NO,,-0.2804856
GITIATAHVEYETAKR,nt,G,115,true,"Arabidopsis translation initiation landscape - NT",167b,35069635,,,,,,,,
GITIATAHVE,nt,G,115,true,"Arg/N-end rule seed, prt6 vs. Wt",99,29168982,"MASCOT Score",50.1400000,,-0.7402676,0.0624251,NO,0.00049870001384988,-0.6119532
AHVDCPGHADY,nt,A,133,false,"Arabidopsis translation initiation landscape - NT",167b,35069635,,,,,,,,
HYAHVDCPGHADYVK,sno,C,137,false,"Cold stress nitrosylation - 4°C vs 22°C",65,24388526,,,,,,,,
HYAHVDCPGHADYVK,sno,C,137,false,"Site-specific nitrosomeproteomic id - gsnor1-3",90a,25699590,XCorr,4.3867521,,,,,2.2570000624E-7,-5.7307155
HYAHVDCPGHADYVK,sno,C,137,false,"Site-specific nitrosomeproteomic id - gsnor1-3",90b,25699590,XCorr,4.5800000,,,,,2.1519999791053E-5,-6.9700000
HYAHVDCPGHADYVK,sno,C,137,false,"hot5-4 / wildtype, FAT-switch S-nitrosoproteome",169,37277371,,,,,,,,
HYAHVDCPGHADYVK,so,C,137,false,"Arabidopsis S-sulfenylation chemoproteomics",108,31578252,"pFind PSM Score",0.0000028,,1.8315000,,,,0.4441530
HYAHVDCPGHADYVK,so,C,137,false,"S-sulfenylation site detection using YAP1C",110,32714340,,,,,,,,
QVGVPSLVCFLNK,ox,C,188,true,"Redox kickstart of mitochondria",112,31871212,,,,-1.2340217,0.0070396,YES,,
QVGVPSLVCFLNK,so,C,188,true,"S-sulfenylation site detection using YAP1C",110,32714340,,,,,,,,
ELLSFYKFPGDDIPIIR,nt,E,211,true,"Arabidopsis translation initiation landscape - NT",167b,35069635,,,,,,,,
DAVDEYIPDPVR,nt,D,251,true,"Arg/N-end rule seed, prt6 vs. Wt",99,29168982,"MASCOT Score",56.0000000,,-0.9008667,0.1258716,NO,0.00092289998428896,-1.7554373
DAVDEYIPDPVR,nta,D,251,true,"FtsH12 N-terminome: WT / FtsH12 knockdown miRNA",118,33216923,"MaxQuant score",69.2610000,,,,,1.8700000055105E-6,
STVTGVEMFKK,ac,K,323,true,"Quantitative Acetylproteomics",101,29440448,,,,,,,,
STVTGVEMFKK,ac,K,324,true,"Quantitative Acetylproteomics",101,29440448,,,,,,,,
KILDNGQAGDNVGLLLR,nt,K,324,true,"Tic56 chloroplast import - ppi2",89b,25588737,XCorr,3.9973037,,,,,,
GMVIAKPGSCK,ox,C,359,true,"SPEAR - 50 mM H2O2 / mock",138b,34619326,,,,-3.0842101,0.0471511,YES,,
GMVIAKPGSCK,so,C,359,true,"Arabidopsis S-sulfenylation chemoproteomics",108,31578252,"pFind PSM Score",0.3133480,,0.9174300,,,,-0.7728484
GMVIAKPGSCK,so,C,359,true,"S-sulfenylation site detection using YAP1C",110,32714340,,,,,,,,
