Peptide,PTM,ModifiedAA,ModifiedPosition,PeptideUniqueToGene,ExperimentDesc,ExpID,PubmedID,ScoreType,IdentScore,LocProb,Log2FChange,PQ-val,QuantSig,PEP,MassErrorPPM
RSGSDSDEELKGLSHEEYR,ph,S,27,true,"atm and atr DNA damage response",88,25561503,"MASCOT Score",32.0000000,1.0000000,,,,,-0.2000000
RSGSDSDEELKGLSHEEYR,ph,S,27,true,"Phospho cell culture sucrose/TOR",109,30833711,,,1.0000000,,,,,
SGSDSDEELKGLSHEEYR,ph,S,27,true,"Tissue atlas Arabidopsis - ProteomicsDB",114,32188942,"MaxQuant score",161.0500000,1.0000000,,,,0,
RSGSDSDEELKGLSHEEYR,ph,S,29,true,"atm and atr DNA damage response",88,25561503,"MASCOT Score",32.0000000,1.0000000,,,,,-0.2000000
SGSDSDEELKGLSHEEYR,ph,S,29,true,"atm and atr DNA damage response",88,25561503,"MASCOT Score",38.0000000,1.0000000,,,,,0.2200000
SGSDSDEELKGLSHEEYR,ph,S,29,true,"Tissue atlas Arabidopsis - ProteomicsDB",114,32188942,"MaxQuant score",240.6800000,1.0000000,,,,0,
RSGSDSDEELK,ph,S,29,true,"atm and atr DNA damage response",88,25561503,"MASCOT Score",27.0000000,1.0000000,,,,,-0.6600000
SGSDSDEELK,ph,S,29,true,"atm and atr DNA damage response",88,25561503,"MASCOT Score",42.0000000,1.0000000,,,,,0.1100000
RSGSDSDEELKGLSHEEYR,ph,S,31,true,"atm and atr DNA damage response",88,25561503,"MASCOT Score",32.0000000,1.0000000,,,,,-0.2000000
RSGSDSDEELKGLSHEEYR,ph,S,31,true,"Phospho cell culture sucrose/TOR",109,30833711,,,0.9999990,,,,,
SGSDSDEELKGLSHEEYRR,ph,S,31,true,"Tissue atlas Arabidopsis - ProteomicsDB",114,32188942,"MaxQuant score",240.6800000,1.0000000,,,,0,
SGSDSDEELKGLSHEEYR,ph,S,31,true,"atm and atr DNA damage response",88,25561503,"MASCOT Score",38.0000000,1.0000000,,,,,0.2200000
RSGSDSDEELK,ph,S,31,true,"atm and atr DNA damage response",88,25561503,"MASCOT Score",27.0000000,1.0000000,,,,,-0.6600000
SGSDSDEELK,ph,S,31,true,"atm and atr DNA damage response",88,25561503,"MASCOT Score",42.0000000,1.0000000,,,,,0.1100000
FCFWENTPSPPRDQNEDSDENADEIQDK,ph,T,63,true,"srk2dei ABA signaling phopshoproteomics",83,23572148,"MASCOT Score",58.0000000,,,,,,-0.0015000
FCFWENTPSPPRDQNEDSDENADEIQDK,ph,T,63,true,"SnRK2 protein kinase substrates",85,23776212,XCorr,4.1558633,1.0000000,,,,3.96250006599E-16,
FCFWENTPSPPRDQNEDSDENADEIQDK,ph,T,63,true,"Brassinosteroid-Regulated Phosphorylation Dynamics",94,26187819,"MaxQuant Score",124.8100000,1.0000000,,,,5.5009998894059E-17,0.7170000
FCFWENTPSPPR,ph,T,63,true,"Tissue atlas Arabidopsis - ProteomicsDB",114,32188942,"MaxQuant score",225.3200000,1.0000000,,,,0,
FCFWENTPSPPRDQNEDSDENADEIQDK,ph,S,65,true,"srk2dei ABA signaling phopshoproteomics",83,23572148,"MASCOT Score",58.0000000,,,,,,-0.0015000
FCFWENTPSPPRDQNEDSDENADEIQDK,ph,S,65,true,"SnRK2 protein kinase substrates",85,23776212,XCorr,4.1558633,1.0000000,,,,3.96250006599E-16,
FCFWENTPSPPRDQNEDSDENADEIQDK,ph,S,65,true,"Brassinosteroid-Regulated Phosphorylation Dynamics",94,26187819,"MaxQuant Score",124.8100000,1.0000000,,,,5.5009998894059E-17,0.7170000
FCFWENTPSPPR,ph,S,65,true,"Tissue atlas Arabidopsis - ProteomicsDB",114,32188942,"MaxQuant score",246.2500000,1.0000000,,,,0,
FCFWENTPSPPRDQNEDSDENADEIQDK,ph,S,74,true,"srk2dei ABA signaling phopshoproteomics",83,23572148,"MASCOT Score",58.0000000,,,,,,-0.0015000
FCFWENTPSPPRDQNEDSDENADEIQDK,ph,S,74,true,"SnRK2 protein kinase substrates",85,23776212,XCorr,4.1558633,1.0000000,,,,3.96250006599E-16,
FCFWENTPSPPRDQNEDSDENADEIQDK,ph,S,74,true,"Brassinosteroid-Regulated Phosphorylation Dynamics",94,26187819,"MaxQuant Score",124.8100000,1.0000000,,,,5.5009998894059E-17,0.7170000
DQNEDSDENADEIQDK,ph,S,74,true,"STN8 phosphoproteome",38,21768351,"MASCOT Score",89.3200000,,,,,,-1.3251700
DQNEDSDENADEIQDK,ph,S,74,true,"atm and atr DNA damage response",88,25561503,"MASCOT Score",51.0000000,1.0000000,,,,,-1.2800000
DQNEDSDENADEIQDK,ph,S,74,true,"Tissue atlas Arabidopsis - ProteomicsDB",114,32188942,"MaxQuant score",462.6700000,1.0000000,,,,0,
KGKSDSESESDGLR,ph,S,102,true,"Tissue atlas Arabidopsis - ProteomicsDB",114,32188942,"MaxQuant score",154.7000000,1.0000000,,,,9.2693296959876E-17,
KGKSDSESESDGLR,ph,S,104,true,"Tissue atlas Arabidopsis - ProteomicsDB",114,32188942,"MaxQuant score",154.7000000,1.0000000,,,,9.2693296959876E-17,
KGKSDSESESDGLR,ph,S,106,true,"Tissue atlas Arabidopsis - ProteomicsDB",114,32188942,"MaxQuant score",154.7000000,1.0000000,,,,9.2693296959876E-17,
TKSGSDSDGTEEDSK,ph,S,231,true,"atm and atr DNA damage response",88,25561503,"MASCOT Score",50.0000000,1.0000000,,,,,0.3100000
TKSGSDSDGTEEDSK,ph,S,233,true,"atm and atr DNA damage response",88,25561503,"MASCOT Score",50.0000000,1.0000000,,,,,0.3100000
TKSGSDSDGTEEDSK,ph,S,235,true,"atm and atr DNA damage response",88,25561503,"MASCOT Score",50.0000000,1.0000000,,,,,0.3100000
TKSGSDSDGTEEDSK,ph,T,238,true,"atm and atr DNA damage response",88,25561503,"MASCOT Score",50.0000000,1.0000000,,,,,0.3100000
FEDLGYVMSGSR,ph,S,347,true,"Tissue atlas Arabidopsis - ProteomicsDB",114,32188942,"MaxQuant score",154.6500000,0.8576290,,,,1.209640054789E-9,
ENQVYSAEDKR,ph,S,367,true,"Tissue atlas Arabidopsis - ProteomicsDB",114,32188942,"MaxQuant score",159.6600000,1.0000000,,,,9.4797801553081E-11,
KENQVYSAEDKR,ub,K,371,true,"Arabidopsis ubiquitination COFRADIC",40,26744219,"MaxQuant Score",50.0880000,1.0000000,,,,0.00090290000662208,2.4730000
EAKVMSDLQR,ub,K,388,true,"Arabidopsis ubiquitination COFRADIC",40,26744219,"MaxQuant Score",55.3140000,1.0000000,,,,0.014000000432134,-1.4390000
VMSDLQR,ph,S,391,true,"Tissue atlas Arabidopsis - ProteomicsDB",114,32188942,"MaxQuant score",93.7010000,1.0000000,,,,0.0062228101305664,
HMGEEVGPNHDPFGAGKTEEDDD,ph,T,417,true,"Tissue atlas Arabidopsis - ProteomicsDB",114,32188942,"MaxQuant score",161.1500000,1.0000000,,,,5.3797193291955E-39,
