Peptide,PTM,ModifiedAA,ModifiedPosition,PeptideUniqueToGene,ExperimentDesc,ExpID,PubmedID,ScoreType,IdentScore,LocProb,Log2FChange,PQ-val,QuantSig,PEP,MassErrorPPM
DRDSGNLDCAAPMTTK,ph,S,97,true,"Tissue atlas Arabidopsis - ProteomicsDB",114,32188942,"MaxQuant score",87.3560000,1.0000000,,,,0.00029136799275875,
TVIVDSDDYRR,ph,S,115,true,"Phosphorylation Early Elicitor Signaling",23,17317660,,,,,,,,
EYSDDEDLDEENETTGSLKPEDVKK,ph,Y,195,true,"Large-scale phosphorylation discovery",44,23111157,XCorr,3.6690000,,,,,,
EYSDDEDLDEENETTGSLKPEDVKK,ph,S,196,true,"Phospho cell culture sucrose/TOR",109,30833711,,,0.9999030,,,,,
EYSDDEDLDEENETTGSLKPEDVKK,ph,S,196,true,"Tissue atlas Arabidopsis - ProteomicsDB",114,32188942,"MaxQuant score",313.5500000,1.0000000,,,,0,
EYSDDEDLDEENETTGSLKPEDVK,ph,S,196,true,"TOR Kinase and ABA Receptor",100,29290610,XCorr,4.1608176,0.9780000,,,,6.7050001462121E-7,
EYSDDEDLDEENETTGSLKPEDVK,ph,S,196,true,"Lateral root-induction - NAA vs control",106,23328941,"MASCOT Score",53.0000000,,,,,,
RMLSNRESARRSRRRK,ph,S,224,false,"SnRK1-triggered switch of bZIP63 dimerization",95,26263501,XCorr,4.4500000,,,,,,
KQEQTSDLETQVNDLKGEHSSLLK,ph,S,241,true,"Tissue atlas Arabidopsis - ProteomicsDB",114,32188942,"MaxQuant score",72.9350000,0.7883270,,,,1.06698996305E-8,
QLSNMNHKYDEAAVGNR,ph,S,262,true,"Tissue atlas Arabidopsis - ProteomicsDB",114,32188942,"MaxQuant score",60.5410000,0.9995010,,,,0.00020961099653505,
LGNNFAAPPSQTSSPLQR,ph,S,373,true,"Tissue atlas Arabidopsis - ProteomicsDB",114,32188942,"MaxQuant score",158.3100000,0.8716740,,,,1.8640099090196E-21,
