Peptide,PTM,ModifiedAA,ModifiedPosition,PeptideUniqueToGene,ExperimentDesc,ExpID,PubmedID,ScoreType,IdentScore,LocProb,Log2FChange,PQ-val,QuantSig,PEP,MassErrorPPM
ASSWIQEDSCPDYMLK,sno,C,217,true,"Site-specific nitrosomeproteomic id - gsnor1-3",90b,25699590,XCorr,3.4500000,,,,,0.043669998645782,-6.1500000
EHSGCR,sno,C,271,false,"hot5-4 / wildtype, FAT-switch S-nitrosoproteome",169,37277371,,,,,,,,
EAFEIFCNK,sno,C,375,true,"hot5-4 / wildtype, FAT-switch S-nitrosoproteome",169,37277371,,,,0.0156863,0.8380448,NO,,
QQCGGQFTSK,sno,C,463,true,"hot5-4 / wildtype, FAT-switch S-nitrosoproteome",169,37277371,,,,,,,,
CVEVFK,so,C,531,false,"S-sulfenylation site detection using YAP1C",110,32714340,,,,,,,,
LLHSLSCAK,so,C,614,true,"Arabidopsis S-sulfenylation chemoproteomics",108,31578252,"pFind PSM Score",0.0370219,,1.2215800,,,,1.5863148
VLGHQQLVSECVEQLSR,so,C,696,true,"Arabidopsis S-sulfenylation chemoproteomics",108,31578252,"pFind PSM Score",0.0000246,,1.2195100,,,,-0.8177131
VLGHQQLVSECVEQLSR,so,C,696,true,"S-sulfenylation site detection using YAP1C",110,32714340,,,,,,,,
