Peptide,PTM,ModifiedAA,ModifiedPosition,PeptideUniqueToGene,ExperimentDesc,ExpID,PubmedID,ScoreType,IdentScore,LocProb,Log2FChange,PQ-val,QuantSig,PEP,MassErrorPPM
AGIKVFGHPASIATR,nt,A,2,true,"N-terminal ChaFRADIC",92,26010716,"MASCOT Score",47.8200000,,,,,5.9740000324382E-7,
AGIKVFGHPASIATR,nt,A,2,true,"Stromal N-terminome",96,26371235,"MASCOT Score",64.4000000,,,,,,
AGIKVFGHPASIATR,nt,A,2,true,"FtsH12 N-terminome: WT / FtsH12 knockdown miRNA",118,33216923,"MaxQuant score",103.2000000,,-0.3481283,0.1598422,NO,1.5299999371433E-32,
AGIKVFGHPASIATR,nt,A,2,true,"HUNTER N-terminome: legumain, GluC and trypsin",119,31951383,"MaxQuant score",125.2800000,,,,,,
AGIKVFGHPASIA,nt,A,2,true,"N-terminal ChaFRADIC",92,26010716,"MASCOT Score",28.4300000,,,,,0.00074729998596013,
AGIKVFGHPA,nt,A,2,false,"N-term acetylation drought responses",5,26184543,,,,,,,,
AGIKVFGHPASIATRR,nta,A,2,true,"HUNTER N-terminome: legumain, GluC and trypsin",119,31951383,"MaxQuant score",,,,,,,
AGIKVFGHPASIATR,nta,A,2,true,"Arg/N-end rule pathway Roots",80,25728785,"MASCOT Score",35.7700000,,,,,0.0010169999441132,
AGIKVFGHPASIATR,nta,A,2,true,"N-terminal ChaFRADIC",92,26010716,"MASCOT Score",47.8200000,,,,,5.9740000324382E-7,
AGIKVFGHPASIATR,nta,A,2,true,"Stromal N-terminome",96,26371235,"MASCOT Score",64.4000000,,,,,,
AGIKVFGHPASIATR,nta,A,2,true,"HUNTER N-terminome: legumain, GluC and trypsin",119,31951383,"MaxQuant score",145.6000000,,,,,,
AGIKVFGHPASIA,nta,A,2,true,"N-terminal ChaFRADIC",92,26010716,"MASCOT Score",28.4300000,,,,,0.00074729998596013,
AGIKVFGHPA,nta,A,2,false,"N-term acetylation drought responses",5,26184543,,,,,,,,
VFGHPASIATR,ph,S,12,true,"Tissue atlas Arabidopsis - ProteomicsDB",114,32188942,"MaxQuant score",119.2500000,0.9998760,,,,8.7488797362312E-6,
NLDFELVHVELKDGEHK,ub,K,37,false,"upl3 mutant / wildtype",168,35926874,"MaxQuant score",153.7200000,1.0000000,-0.1078033,0.7041200,NO,4.0594001057603E-17,0.8181700
SIYGLTTDE,nt,S,126,true,"Arg/N-end rule seed, prt6 vs. Wt",99,29168982,"MASCOT Score",25.2200000,,-1.0994127,0.0663773,NO,0.022140000015497,-4.5581517
SIYGLTTDEAVVAEEEAK,ph,T,131,true,"SnRK2 protein kinase substrates",85,23776212,XCorr,3.8214650,0.9620000,,,,0.00052037299610674,
SIYGLTTDEAVVAEEEAK,ph,T,131,true,"Tissue atlas Arabidopsis - ProteomicsDB",114,32188942,"MaxQuant score",258.1700000,0.9956770,,,,0,
TDLHHIPAIQ,nt,T,169,true,"N-terminal ChaFRADIC",92,26010716,"MASCOT Score",24.0300000,,,,,5.7189998187823E-5,
KLFTERPR,ub,K,187,false,"upl3 mutant / wildtype",168,35926874,"MaxQuant score",116.3700000,1.0000000,-0.5002179,0.5322000,NO,0.021084500476718,0.9292600
VNEWVAEITKRPASEK,ub,K,204,false,"upl3 mutant / wildtype",168,35926874,"MaxQuant score",120.6300000,1.0000000,-0.7759597,0.0601020,NO,6.8173298117813E-9,-2.5682000
