Peptide,PTM,ModifiedAA,ModifiedPosition,PeptideUniqueToGene,ExperimentDesc,ExpID,PubmedID,ScoreType,IdentScore,LocProb,Log2FChange,PQ-val,QuantSig,PEP,MassErrorPPM
MDSKSVTPEPTNPFYASSGQSGKTY,nta,M,1,true,"Arg/N-end rule seed, prt6 vs. Wt",99,29168982,"MASCOT Score",33.1400000,,-1.4777228,0.0008607,YES,0.0012989999959245,-1.1278949
MDSKSVTPEPTNPF,nta,M,1,true,"Arg/N-end rule seed, prt6 vs. Wt",99,29168982,"MASCOT Score",39.6100000,,0.3891367,0.0363632,NO,0.034960001707077,-4.0288573
SVTPEPTNPFYASSGQSGK,ph,T,7,true,"Tissue atlas Arabidopsis - ProteomicsDB",114,32188942,"MaxQuant score",197.7200000,0.9965860,,,,1.4012984643248E-45,
SVTPEPTNPFYASSGQSGK,ph,S,17,true,"Tissue atlas Arabidopsis - ProteomicsDB",114,32188942,"MaxQuant score",174.6500000,0.8669290,,,,1.2905400167915E-28,
SVTPEPTNPFYASSGQSGK,ph,S,21,true,"Tissue atlas Arabidopsis - ProteomicsDB",114,32188942,"MaxQuant score",177.0000000,0.9375500,,,,3.129260001437E-29,
ELDSSSEAVSGNSDK,ph,S,53,true,"Tissue atlas Arabidopsis - ProteomicsDB",114,32188942,"MaxQuant score",249.9700000,0.9998560,,,,0,
ELDSSSEAVSGNSDK,ph,S,54,true,"Tissue atlas Arabidopsis - ProteomicsDB",114,32188942,"MaxQuant score",165.8600000,0.7599680,,,,3.0711700272756E-14,
ELDSSSEAVSGNSDK,ph,S,55,true,"Tissue atlas Arabidopsis - ProteomicsDB",114,32188942,"MaxQuant score",124.2000000,0.8208550,,,,2.8507799925137E-6,
ELDSSSEAVSGNSDKVGADDLSDSEK,ph,S,62,true,"Tissue atlas Arabidopsis - ProteomicsDB",114,32188942,"MaxQuant score",202.7900000,0.9994580,,,,0,
ELDSSSEAVSGNSDK,ph,S,62,true,"TOR Kinase and ABA Receptor",100,29290610,XCorr,5.7319913,1.0000000,,,,4.1780001680536E-8,
ELDSSSEAVSGNSDKVGADDLSDSEKEKPNLVGDGK,ph,S,71,true,"PAMP-triggered phosphorylation",48,24601666,"MASCOT Score",50.6200000,,,,,,
ELDSSSEAVSGNSDKVGADDLSDSEK,ph,S,71,true,"STN8 phosphoproteome",38,21768351,"MASCOT Score",49.2300000,,,,,,-0.3965690
ELDSSSEAVSGNSDKVGADDLSDSEK,ph,S,71,true,"Chloroplast kinase substrates",60,19376835,"MASCOT Score",40.0500000,,,,,,-1.0640100
ELDSSSEAVSGNSDKVGADDLSDSEK,ph,S,71,true,"srk2dei ABA signaling phopshoproteomics",83,23572148,"MASCOT Score",66.0000000,,,,,,0.0001000
ELDSSSEAVSGNSDKVGADDLSDSEK,ph,S,71,true,"LAXIC - ABA stress",84a,23660473,XCorr,5.6700000,0.8430000,,,,0.0014148999471217,
ELDSSSEAVSGNSDKVGADDLSDSEK,ph,S,71,true,"LAXIC - mannitol vs control",84b,23660473,XCorr,4.5800000,0.9400000,-1.0063032,,NO,1.0700000049402E-13,
ELDSSSEAVSGNSDKVGADDLSDSEK,ph,S,71,true,"SnRK2 protein kinase substrates",85,23776212,XCorr,4.5109186,0.9200000,,,,1.2574999635334E-12,
VGADDLSDSEKEKPNLVGDGK,ph,S,71,true,"Arabidopsis root NAA phosphoproteome",18a,27643528,"MaxQuant Score",221.8500000,0.9980000,,,,0,0.2090000
VGADDLSDSEKEKPNLVGDGK,ph,S,71,true,"Large-scale phosphorylation discovery",44,23111157,XCorr,4.6240000,,,,,,
VGADDLSDSEKEKPNLVGDGK,ph,S,71,true,"PAMP-triggered phosphorylation",48,24601666,"MASCOT Score",26.0200000,,,,,,
VGADDLSDSEKEKPNLVGDGK,ph,S,71,true,"LAXIC - mannitol vs control",84b,23660473,XCorr,3.8900000,0.9700000,,,,0.0020051300525665,
VGADDLSDSEKEKPNLVGDGK,ph,S,71,true,"atm and atr DNA damage response",88,25561503,"MASCOT Score",29.0000000,0.9210000,,,,,-0.3000000
VGADDLSDSEKEKPNLVGDGK,ph,S,71,true,"Phospho cell culture sucrose/TOR",109,30833711,,,0.9998030,,,,,
VGADDLSDSEKEKPNLVGDGK,ph,S,71,true,"Col-0 callus - FC Col-0 vs. Col-0 Xray",111a,31410901,,23.7800000,,0.1908082,0.0000000,NO,,0.3670016
VGADDLSDSEKEKPNLVGDGK,ph,S,71,true,"Col-0 X-ray callus - FC Col-0 vs. Col-0 Xray",111b,31410901,,23.7800000,,0.1908082,0.0000000,NO,,0.3670016
VGADDLSDSEKEKPNLVGDGK,ph,S,71,true,"atm callus - FC atm vs. atm Xray",111c,31410901,,23.7800000,,-0.1297612,0.0000000,NO,,0.3670016
VGADDLSDSEKEKPNLVGDGK,ph,S,71,true,"atm-3 X-ray callus - FC atm vs. atm Xray",111d,31410901,,23.7800000,,-0.1297612,0.0000000,NO,,0.3670016
VGADDLSDSEKEKPNLVGDGK,ph,S,71,true,"Tissue atlas Arabidopsis - ProteomicsDB",114,32188942,"MaxQuant score",308.2700000,1.0000000,,,,0,
VGADDLSDSEKEKPNLVGDGK,ph,S,71,true,"Touch-induced phosphorylation: 40s touch vs untouc",136,30291188,"MASCOT score",85.7400000,,-0.0473956,0.4978544,NO,,5.3501549
VGADDLSDSEKEK,ph,S,71,true,"atm and atr DNA damage response",88,25561503,"MASCOT Score",37.0000000,1.0000000,,,,,-1.3800000
VGADDLSDSEK,ph,S,71,true,"STN8 phosphoproteome",38,21768351,"MASCOT Score",81.9900000,,,,,,1.1225900
VGADDLSDSEK,ph,S,71,true,"Pollen phosphoproteome Arabidopsis",43,22631563,"MASCOT Score",62.6700000,,,,,,-1.7545500
VGADDLSDSEK,ph,S,71,true,"Tyrosine phosphorylation in Arabidopsis",59,18463617,"MASCOT Score",90.0000000,,,,,,-0.8234048
VGADDLSDSEK,ph,S,71,true,"Chloroplast kinase substrates",60,19376835,"MASCOT Score",90.1200000,,,,,,-1.2448800
VGADDLSDSEK,ph,S,71,true,"Conserved plant phosphoproteome - Arabidopsis",61a,20466843,"MASCOT Score",90.0000000,1.0000000,,,,,
VGADDLSDSEK,ph,S,71,true,"srk2dei ABA signaling phopshoproteomics",83,23572148,"MASCOT Score",91.0000000,,,,,,0.0002000
VGADDLSDSEK,ph,S,71,true,"LAXIC - ABA stress",84a,23660473,XCorr,4.5000000,1.0000000,,,,3.0499999411404E-5,
VGADDLSDSEK,ph,S,71,true,"LAXIC - mannitol vs control",84b,23660473,XCorr,4.2800000,1.0000000,-1.4220791,,NO,1.2499999924032E-9,
VGADDLSDSEK,ph,S,71,true,"SnRK2 protein kinase substrates",85,23776212,XCorr,3.8654745,1.0000000,,,,0.017472600564361,
VGADDLSDSEK,ph,S,71,true,"SIRK1 phosphorylation",86a,23820729,"MaxQuant Score",155.8400000,0.9650000,,,,0.00096939998911694,7.6710000
VGADDLSDSEK,ph,S,71,true,"SIRK1 exp - sirk1 mutant vs WT",86b,23820729,,,,-0.6234931,,NO,,
VGADDLSDSEK,ph,S,71,true,"SIRK1 exp - 35S:SIRK1 vs WT",86c,23820729,,,,1.4524851,,NO,,
VGADDLSDSEK,ph,S,71,true,"atm and atr DNA damage response",88,25561503,"MASCOT Score",57.0000000,0.9980000,,,,,-0.1100000
VGADDLSDSEK,ph,S,71,true,"TOR Kinase and ABA Receptor",100,29290610,XCorr,4.7101183,0.9932000,,,,2.7599999157246E-5,
VGADDLSDSEK,ph,S,71,true,"Lateral root-induction - NAA vs control",106,23328941,"MASCOT Score",43.0000000,,0.0172904,0.9864674,NO,,
ELDSSSEAVSGNSDKVGADDLSDSEKEKPNLVGDGK,ph,S,73,true,"PAMP-triggered phosphorylation",48,24601666,"MASCOT Score",56.3500000,,,,,,
ELDSSSEAVSGNSDKVGADDLSDSEK,ph,S,73,true,"srk2dei ABA signaling phopshoproteomics",83,23572148,"MASCOT Score",45.0000000,,,,,,-0.0024000
VGADDLSDSEKEKPNLVGDGK,ph,S,73,true,"Phosphoproteome ethylene-regulated time response",46,24043427,"MASCOT Score",59.9900000,,,,,,-5.1557000
VGADDLSDSEKEKPNLVGDGK,ph,S,73,true,"LAXIC - ABA stress",84a,23660473,XCorr,4.4900000,0.8510000,,,,1.920000067912E-5,
VGADDLSDSEKEKPNLVGDGK,ph,S,73,true,"SnRK2 protein kinase substrates",85,23776212,XCorr,4.3227963,0.9950000,,,,0.0016761899460107,
VGADDLSDSEKEKPNLVGDGK,ph,S,73,true,"Tissue atlas Arabidopsis - ProteomicsDB",114,32188942,"MaxQuant score",175.0600000,1.0000000,,,,0,
IENGSVDVDVK,ph,S,162,true,"STN8 phosphoproteome",38,21768351,"MASCOT Score",44.3500000,,,,,,-3.8742500
IENGSVDVDVK,ph,S,162,true,"atm and atr DNA damage response",88,25561503,"MASCOT Score",56.0000000,1.0000000,,,,,-1.8100000
IENGSVDVDVK,ph,S,162,true,"TOR Kinase and ABA Receptor",100,29290610,XCorr,2.2918143,1.0000000,,,,0.012480000033975,
IENGSVDVDVK,ph,S,162,true,"Tissue atlas Arabidopsis - ProteomicsDB",114,32188942,"MaxQuant score",97.4630000,1.0000000,,,,0.00010269800259266,
QASTDGESESK,ph,S,171,true,"atm and atr DNA damage response",88,25561503,"MASCOT Score",64.0000000,0.9410000,,,,,-1.1700000
QASTDGESESK,ph,T,172,true,"atm and atr DNA damage response",88,25561503,"MASCOT Score",55.0000000,1.0000000,,,,,0.3300000
KDDEGESELGGKVDVDDK,ph,S,198,true,"atm and atr DNA damage response",88,25561503,"MASCOT Score",22.0000000,1.0000000,,,,,1.8800000
KDDEGESELGGKVDVDDK,ph,S,198,true,"Tissue atlas Arabidopsis - ProteomicsDB",114,32188942,"MaxQuant score",177.1200000,1.0000000,,,,3.9182698653021E-29,
VDVDDKSDNVIEEEGVELTDK,ph,S,210,true,"Chloroplast kinase substrates",60,19376835,"MASCOT Score",70.6300000,,,,,,-0.4814300
VDVDDKSDNVIEEEGVELTDK,ph,S,210,true,"LAXIC - mannitol vs control",84b,23660473,XCorr,3.1200000,1.0000000,,,,1.0100000054081E-6,
VDVDDKSDNVIEEEGVELTDK,ph,S,210,true,"SnRK2 protein kinase substrates",85,23776212,XCorr,3.5094922,1.0000000,,,,2.5953900149034E-6,
VDVDDKSDNVIEEEGVELTDK,ph,S,210,true,"TOR Kinase and ABA Receptor",100,29290610,XCorr,6.6578703,1.0000000,,,,1.1569999819327E-10,
VDVDDKSDNVIEEEGVELTDK,ph,S,210,true,"Phospho cell culture sucrose/TOR",109,30833711,,,1.0000000,,,,,
VDVDDKSDNVIEEEGVELTDK,ph,S,210,true,"Tissue atlas Arabidopsis - ProteomicsDB",114,32188942,"MaxQuant score",284.3600000,1.0000000,,,,0,
SDNVIEEEGVELTDK,ph,S,210,true,"srk2dei ABA signaling phopshoproteomics",83,23572148,"MASCOT Score",80.0000000,,,,,,0.0015000
INADAETLEVANKFDQIGDDDSGEFEPVSDK,ph,S,281,true,"srk2dei ABA signaling phopshoproteomics",83,23572148,"MASCOT Score",90.0000000,,,,,,-0.0018000
INADAETLEVANKFDQIGDDDSGEFEPVSDK,ph,S,281,true,"SnRK2 protein kinase substrates",85,23776212,XCorr,5.1448402,1.0000000,,,,9.1421797909774E-10,
INADAETLEVANKFDQIGDDDSGEFEPVSDK,ph,S,281,true,"Touch-induced phosphorylation: 40s touch vs untouc",136,30291188,"MASCOT score",73.3800000,,-0.0078861,0.9769234,NO,,0.6092334
FDQIGDDDSGEFEPVSDK,ph,S,281,true,"STN8 phosphoproteome",38,21768351,"MASCOT Score",116.5400000,,,,,,-1.8528200
FDQIGDDDSGEFEPVSDK,ph,S,281,true,"Tyrosine phosphorylation in Arabidopsis",59,18463617,"MASCOT Score",81.0000000,,,,,,-1.7798767
FDQIGDDDSGEFEPVSDK,ph,S,281,true,"Chloroplast kinase substrates",60,19376835,"MASCOT Score",96.1000000,,,,,,-0.7955460
FDQIGDDDSGEFEPVSDK,ph,S,281,true,"srk2dei ABA signaling phopshoproteomics",83,23572148,"MASCOT Score",98.0000000,,,,,,-0.0002000
FDQIGDDDSGEFEPVSDK,ph,S,281,true,"LAXIC - ABA stress",84a,23660473,XCorr,5.7900000,1.0000000,,,,0.0011169699719176,
FDQIGDDDSGEFEPVSDK,ph,S,281,true,"LAXIC - mannitol vs control",84b,23660473,XCorr,4.4900000,1.0000000,,,,0.0020022999960929,
FDQIGDDDSGEFEPVSDK,ph,S,281,true,"SnRK2 protein kinase substrates",85,23776212,XCorr,4.3674898,1.0000000,,,,1.0884900092378E-8,
FDQIGDDDSGEFEPVSDK,ph,S,281,true,"atm and atr DNA damage response",88,25561503,"MASCOT Score",53.0000000,1.0000000,,,,,-0.3100000
FDQIGDDDSGEFEPVSDK,ph,S,281,true,"TOR Kinase and ABA Receptor",100,29290610,XCorr,6.0164309,1.0000000,,,,6.8070001191245E-8,
FDQIGDDDSGEFEPVSDK,ph,S,281,true,"Lateral root-induction - NAA vs control",106,23328941,"MASCOT Score",34.0000000,,,,,,
FDQIGDDDSGEFEPVSDK,ph,S,281,true,"Phosphorylation tonoplast membrane fraction",107,18686298,"MASCOT Score",43.0000000,,,,,,
FDQIGDDDSGEFEPVSDK,ph,S,281,true,"Phospho cell culture sucrose/TOR",109,30833711,,,1.0000000,,,,,
FDQIGDDDSGEFEPVSDK,ph,S,281,true,"Tissue atlas Arabidopsis - ProteomicsDB",114,32188942,"MaxQuant score",307.5200000,1.0000000,,,,0,
FDQIGDDDSGEFEPVSDK,ph,S,288,true,"Chloroplast kinase substrates",60,19376835,"MASCOT Score",95.2700000,,,,,,-1.2761300
FDQIGDDDSGEFEPVSDK,ph,S,288,true,"srk2dei ABA signaling phopshoproteomics",83,23572148,"MASCOT Score",71.0000000,,,,,,-0.0021000
FDQIGDDDSGEFEPVSDK,ph,S,288,true,"Tissue atlas Arabidopsis - ProteomicsDB",114,32188942,"MaxQuant score",314.3800000,1.0000000,,,,0,
FTSESDSIADSSK,ph,T,300,true,"atm and atr DNA damage response",88,25561503,"MASCOT Score",21.0000000,0.9910000,,,,,1.3200000
FTSESDSIADSSK,ph,S,301,true,"LAXIC - mannitol vs control",84b,23660473,XCorr,4.0800000,0.9960000,,,,0.0006099630263634,
FTSESDSIADSSK,ph,S,301,true,"atm and atr DNA damage response",88,25561503,"MASCOT Score",75.0000000,0.9970000,,,,,0.0400000
FTSESDSIADSSK,ph,S,301,true,"TOR Kinase and ABA Receptor",100,29290610,XCorr,4.3240910,0.9834000,,,,0.00016589999722783,
FTSESDSIADSSK,ph,S,301,true,"Tissue atlas Arabidopsis - ProteomicsDB",114,32188942,"MaxQuant score",179.5600000,0.9999930,,,,8.1988401521119E-22,
FTSESDSIADSSK,ph,S,303,true,"atm and atr DNA damage response",88,25561503,"MASCOT Score",79.0000000,0.9440000,,,,,0.6000000
FTSESDSIADSSK,ph,S,303,true,"Tissue atlas Arabidopsis - ProteomicsDB",114,32188942,"MaxQuant score",143.6400000,0.9837840,,,,1.5207400565487E-6,
FTSESDSIADSSK,ph,S,305,true,"STN8 phosphoproteome",38,21768351,"MASCOT Score",63.7200000,,,,,,-1.0713600
FTSESDSIADSSK,ph,S,305,true,"LAXIC - ABA stress",84a,23660473,XCorr,2.8700000,1.0000000,,,,0.0026139700785279,
FTSESDSIADSSK,ph,S,305,true,"LAXIC - mannitol vs control",84b,23660473,XCorr,4.0800000,0.9980000,,,,0.0006099630263634,
FTSESDSIADSSK,ph,S,305,true,"SnRK2 protein kinase substrates",85,23776212,XCorr,2.8303657,0.9960000,,,,0.00044473601155914,
FTSESDSIADSSK,ph,S,305,true,"atm and atr DNA damage response",88,25561503,"MASCOT Score",78.0000000,1.0000000,,,,,1.2300000
FTSESDSIADSSK,ph,S,305,true,"TOR Kinase and ABA Receptor",100,29290610,XCorr,4.9934978,0.9927000,,,,1.1329999693999E-7,
FTSESDSIADSSK,ph,S,305,true,"Tissue atlas Arabidopsis - ProteomicsDB",114,32188942,"MaxQuant score",220.9900000,0.9988680,,,,0,
GMTYAEVIK,mox,M,346,true,"cat2 Methionine oxidation - 3h stress",62b,25693801,"MASCOT Score",55.0000000,,-0.4788503,,NO,,
FDPIGQGEGGEVELESDKATEEGGGK,ph,S,448,true,"Chloroplast kinase substrates",60,19376835,"MASCOT Score",57.4500000,,,,,,-2.7888900
FDPIGQGEGGEVELESDKATEEGGGK,ph,S,448,true,"srk2dei ABA signaling phopshoproteomics",83,23572148,"MASCOT Score",30.0000000,,,,,,-0.0021000
FDPIGQGEGGEVELESDKATEEGGGK,ph,S,448,true,"LAXIC - ABA stress",84a,23660473,XCorr,2.7700000,0.7780000,,,,0.16757099330425,
FDPIGQGEGGEVELESDKATEEGGGK,ph,S,448,true,"LAXIC - mannitol vs control",84b,23660473,XCorr,3.0700000,0.9680000,,,,0.093340396881104,
FDPIGQGEGGEVELESDKATEEGGGK,ph,S,448,true,"SnRK2 protein kinase substrates",85,23776212,XCorr,3.5145802,0.9970000,,,,0.0091238096356392,
FDPIGQGEGGEVELESDKATEEGGGK,ph,S,448,true,"TOR Kinase and ABA Receptor",100,29290610,XCorr,5.0898228,0.9997000,,,,1.5179999763859E-6,
FDPIGQGEGGEVELESDKATEEGGGK,ph,S,448,true,"Phospho cell culture sucrose/TOR",109,30833711,,,0.8767200,,,,,
FDPIGQGEGGEVELESDK,ph,S,448,true,"STN8 phosphoproteome",38,21768351,"MASCOT Score",87.1600000,,,,,,-1.9168000
FDPIGQGEGGEVELESDK,ph,S,448,true,"Chloroplast kinase substrates",60,19376835,"MASCOT Score",57.2400000,,,,,,-1.5443500
FDPIGQGEGGEVELESDK,ph,S,448,true,"srk2dei ABA signaling phopshoproteomics",83,23572148,"MASCOT Score",59.0000000,,,,,,-0.0015000
FDPIGQGEGGEVELESDK,ph,S,448,true,"TOR Kinase and ABA Receptor",100,29290610,XCorr,6.4694653,1.0000000,,,,5.7429999644754E-10,
FDPIGQGEGGEVELESDK,ph,S,448,true,"Tissue atlas Arabidopsis - ProteomicsDB",114,32188942,"MaxQuant score",287.3000000,1.0000000,,,,0,
VGVEVEELPVSESLK,ph,S,559,true,"Conserved plant phosphoproteome - Arabidopsis",61a,20466843,"MASCOT Score",47.0000000,1.0000000,,,,,
VGVEVEELPVSESLK,ph,S,559,true,"SnRK2 protein kinase substrates",85,23776212,XCorr,2.8204055,0.9890000,,,,0.0027250200510025,
VGVEVEELPVSESLK,ph,S,559,true,"TOR Kinase and ABA Receptor",100,29290610,XCorr,4.2907639,0.9286000,,,,1.0320000001229E-5,
VGSVDAEEDSIPAAESQFEVRK,ph,S,564,true,"TOR Kinase and ABA Receptor",100,29290610,XCorr,3.0440643,0.9999000,,,,0.0025279999244958,
VGSVDAEEDSIPAAESQFEVR,ph,S,564,true,"STN8 phosphoproteome",38,21768351,"MASCOT Score",54.9400000,,,,,,-2.5174200
VGSVDAEEDSIPAAESQFEVR,ph,S,564,true,"SnRK2 protein kinase substrates",85,23776212,XCorr,4.6785774,1.0000000,,,,4.7162501681797E-10,
VGSVDAEEDSIPAAESQFEVR,ph,S,564,true,"TOR Kinase and ABA Receptor",100,29290610,XCorr,6.2025008,1.0000000,,,,1.1780000086503E-8,
VGSVDAEEDSIPAAESQFEVR,ph,S,564,true,"Tissue atlas Arabidopsis - ProteomicsDB",114,32188942,"MaxQuant score",290.4200000,1.0000000,,,,0,
VGSVDAEEDSIPAAESQFEVR,ph,S,571,true,"LAXIC - ABA stress",84a,23660473,XCorr,3.5500000,0.7730000,,,,0.022966999560595,
VGSVDAEEDSIPAAESQFEVR,ph,S,571,true,"Tissue atlas Arabidopsis - ProteomicsDB",114,32188942,"MaxQuant score",271.7200000,1.0000000,,,,0,
KVVEGDSAEEDENKLPVEDIVSSR,ph,S,589,true,"Arabidopsis root NAA phosphoproteome",18a,27643528,"MaxQuant Score",108.7100000,1.0000000,,,,4.3719998483322E-18,-0.1410000
KVVEGDSAEEDENKLPVEDIVSSR,ph,S,589,true,"STN8 phosphoproteome",38,21768351,"MASCOT Score",121.4000000,,,,,,-0.8094980
KVVEGDSAEEDENKLPVEDIVSSR,ph,S,589,true,"Phosphoproteomic analysis of seed maturation",42,22440515,"MASCOT Score",53.0000000,,,,,,-0.7400000
KVVEGDSAEEDENKLPVEDIVSSR,ph,S,589,true,"PAMP-triggered phosphorylation",48,24601666,"MASCOT Score",47.5600000,,,,,,
KVVEGDSAEEDENKLPVEDIVSSR,ph,S,589,true,"Chloroplast kinase substrates",60,19376835,"MASCOT Score",100.5300000,,,,,,-0.6884530
KVVEGDSAEEDENKLPVEDIVSSR,ph,S,589,true,"srk2dei ABA signaling phopshoproteomics",83,23572148,"MASCOT Score",88.0000000,,,,,,0.0001000
KVVEGDSAEEDENKLPVEDIVSSR,ph,S,589,true,"LAXIC - ABA stress",84a,23660473,XCorr,5.7400000,1.0000000,,,,3.5700000733385E-9,
KVVEGDSAEEDENKLPVEDIVSSR,ph,S,589,true,"LAXIC - mannitol vs control",84b,23660473,XCorr,6.2000000,1.0000000,-1.2742236,,NO,6.34999992144E-7,
KVVEGDSAEEDENKLPVEDIVSSR,ph,S,589,true,"SnRK2 protein kinase substrates",85,23776212,XCorr,6.0230541,1.0000000,,,,7.9669703180549E-14,
KVVEGDSAEEDENKLPVEDIVSSR,ph,S,589,true,"atm and atr DNA damage response",88,25561503,"MASCOT Score",49.0000000,1.0000000,,,,,0.7900000
VVEGDSAEEDENKLPVEDIVSSR,ph,S,589,true,"STN8 phosphoproteome",38,21768351,"MASCOT Score",109.2900000,,,,,,-0.8159220
VVEGDSAEEDENKLPVEDIVSSR,ph,S,589,true,"Chloroplast kinase substrates",60,19376835,"MASCOT Score",96.1500000,,,,,,-0.8159220
VVEGDSAEEDENKLPVEDIVSSR,ph,S,589,true,"Conserved plant phosphoproteome - Arabidopsis",61a,20466843,"MASCOT Score",71.0000000,1.0000000,,,,,
VVEGDSAEEDENKLPVEDIVSSR,ph,S,589,true,"srk2dei ABA signaling phopshoproteomics",83,23572148,"MASCOT Score",92.0000000,,,,,,0.0005000
VVEGDSAEEDENKLPVEDIVSSR,ph,S,589,true,"LAXIC - ABA stress",84a,23660473,XCorr,4.7400000,1.0000000,,,,0.0010141499806195,
VVEGDSAEEDENKLPVEDIVSSR,ph,S,589,true,"LAXIC - mannitol vs control",84b,23660473,XCorr,5.1900000,1.0000000,-1.1414209,,NO,1.4099999489988E-15,
VVEGDSAEEDENKLPVEDIVSSR,ph,S,589,true,"SnRK2 protein kinase substrates",85,23776212,XCorr,5.2279663,1.0000000,,,,5.1531197521994E-16,
VVEGDSAEEDENKLPVEDIVSSR,ph,S,589,true,"Brassinosteroid-Regulated Phosphorylation Dynamics",94,26187819,"MaxQuant Score",88.1760000,1.0000000,,,,0.00097789999563247,1.3060000
VVEGDSAEEDENKLPVEDIVSSR,ph,S,589,true,"TOR Kinase and ABA Receptor",100,29290610,XCorr,5.9354172,1.0000000,,,,4.597000113904E-9,
VVEGDSAEEDENKLPVEDIVSSR,ph,S,589,true,"Phospho cell culture sucrose/TOR",109,30833711,,,1.0000000,,,,,
VVEGDSAEEDENKLPVEDIVSSR,ph,S,589,true,"Tissue atlas Arabidopsis - ProteomicsDB",114,32188942,"MaxQuant score",445.9200000,1.0000000,,,,0,
VVEGDSAEEDENKLPVEDIVSSR,ph,S,589,true,"Touch-induced phosphorylation: 40s touch vs untouc",136,30291188,"MASCOT score",109.4800000,,-0.2852543,0.1776897,NO,,6.5886588
KVVEGDSAEEDENK,ph,S,589,true,"STN8 phosphoproteome",38,21768351,"MASCOT Score",86.2500000,,,,,,-0.2002740
KVVEGDSAEEDENK,ph,S,589,true,"Chloroplast kinase substrates",60,19376835,"MASCOT Score",74.4300000,,,,,,-0.7648040
KVVEGDSAEEDENK,ph,S,589,true,"atm and atr DNA damage response",88,25561503,"MASCOT Score",73.0000000,1.0000000,,,,,-1.0300000
VVEGDSAEEDENK,ph,S,589,true,"TOR Kinase and ABA Receptor",100,29290610,XCorr,4.4991651,1.0000000,,,,3.5759998695539E-7,
KVVEGDSAEEDENKLPVEDIVSSR,ph,S,604,true,"Tissue atlas Arabidopsis - ProteomicsDB",114,32188942,"MaxQuant score",182.1200000,0.8331980,,,,0,
EFSFGGKEVDQEPSGEGVTR,nt,E,607,true,"Metacaspase9 substrates - Col-0 / mc9",51a,23964026,"MASCOT Score",55.0000000,,1.3487143,,NO,,-1.3465965
EFSFGGKEVDQEPSGEGVTR,nt,E,607,true,"Metacaspase9 substrates - in vitro rMC9",51c,23964026,"MASCOT Score",67.0000000,,1.8088919,,NO,,-1.7000322
EFSFGGKEVDQEPSGEGVTR,nt,E,607,true,"HUNTER N-terminome: legumain, GluC and trypsin",119,31951383,"MaxQuant score",89.6680000,,,,,,
EFSFGGKEVDQEPSGEGVTR,ph,S,609,true,"STN8 phosphoproteome",38,21768351,"MASCOT Score",58.1000000,,,,,,-0.7451640
EFSFGGKEVDQEPSGEGVTR,ph,S,609,true,"Chloroplast kinase substrates",60,19376835,"MASCOT Score",58.7000000,,,,,,-0.7451640
EFSFGGKEVDQEPSGEGVTR,ph,S,609,true,"Tissue atlas Arabidopsis - ProteomicsDB",114,32188942,"MaxQuant score",104.8100000,1.0000000,,,,1.5370199335507E-8,
EFSFGGK,ph,S,609,true,"Tyrosine phosphorylation in Arabidopsis",59,18463617,"MASCOT Score",26.0000000,,,,,,-0.3528059
EVDQEPSGEGVTR,ph,S,620,true,"atm and atr DNA damage response",88,25561503,"MASCOT Score",62.0000000,1.0000000,,,,,-0.2300000
EVDQEPSGEGVTR,ph,S,620,true,"Tissue atlas Arabidopsis - ProteomicsDB",114,32188942,"MaxQuant score",172.4300000,0.9989120,,,,3.3674499973023E-15,
EVDQEPSGEGVTRVDGSESEEETEEMIFGSSEAAK,ph,S,630,true,"Brassinosteroid-Regulated Phosphorylation Dynamics",94,26187819,"MaxQuant Score",110.9100000,0.9960000,,,,6.3110002915084E-17,2.0100000
EVDQEPSGEGVTRVDGSESEEETEEMIFGSSEAAK,ph,S,630,true,"TOR Kinase and ABA Receptor",100,29290610,XCorr,6.1499100,0.9927000,,,,8.9450004452374E-6,
VDGSESEEETEEMIFGSSEAAK,ph,S,630,true,"STN8 phosphoproteome",38,21768351,"MASCOT Score",82.0900000,,,,,,
VDGSESEEETEEMIFGSSEAAK,ph,S,630,true,"Large-scale phosphorylation discovery",44,23111157,XCorr,4.0360000,,,,,,
VDGSESEEETEEMIFGSSEAAK,ph,S,630,true,"Chloroplast kinase substrates",60,19376835,"MASCOT Score",49.7500000,,,,,,-1.3886900
VDGSESEEETEEMIFGSSEAAK,ph,S,630,true,"Conserved plant phosphoproteome - Arabidopsis",61a,20466843,"MASCOT Score",41.0000000,1.0000000,,,,,
VDGSESEEETEEMIFGSSEAAK,ph,S,630,true,"srk2dei ABA signaling phopshoproteomics",83,23572148,"MASCOT Score",84.0000000,,,,,,-0.0011000
VDGSESEEETEEMIFGSSEAAK,ph,S,630,true,"LAXIC - ABA stress",84a,23660473,XCorr,5.9300000,1.0000000,,,,0.0005315970047377,
VDGSESEEETEEMIFGSSEAAK,ph,S,630,true,"SnRK2 protein kinase substrates",85,23776212,XCorr,5.7630887,1.0000000,,,,0.0022152198944241,
VDGSESEEETEEMIFGSSEAAK,ph,S,630,true,"atm and atr DNA damage response",88,25561503,"MASCOT Score",62.0000000,0.9300000,,,,,0.8600000
VDGSESEEETEEMIFGSSEAAK,ph,S,630,true,"TOR Kinase and ABA Receptor",100,29290610,XCorr,7.1752772,1.0000000,,,,2.1569999120175E-8,
VDGSESEEETEEMIFGSSEAAK,ph,S,630,true,"Phospho cell culture sucrose/TOR",109,30833711,,,0.9999990,,,,,
VDGSESEEETEEMIFGSSEAAK,ph,S,630,true,"Tissue atlas Arabidopsis - ProteomicsDB",114,32188942,"MaxQuant score",364.6400000,1.0000000,,,,0,
EVDQEPSGEGVTRVDGSESEEETEEMIFGSSEAAK,ph,S,632,true,"Brassinosteroid-Regulated Phosphorylation Dynamics",94,26187819,"MaxQuant Score",110.9100000,0.9910000,,,,6.3110002915084E-17,1.0260000
EVDQEPSGEGVTRVDGSESEEETEEMIFGSSEAAK,ph,S,632,true,"TOR Kinase and ABA Receptor",100,29290610,XCorr,6.1499100,0.9687000,,,,8.9450004452374E-6,
VDGSESEEETEEMIFGSSEAAK,ph,S,632,true,"Chloroplast kinase substrates",60,19376835,"MASCOT Score",49.7500000,,,,,,-1.3886900
VDGSESEEETEEMIFGSSEAAK,ph,S,632,true,"Conserved plant phosphoproteome - Arabidopsis",61a,20466843,"MASCOT Score",41.0000000,1.0000000,,,,,
VDGSESEEETEEMIFGSSEAAK,ph,S,632,true,"srk2dei ABA signaling phopshoproteomics",83,23572148,"MASCOT Score",87.0000000,,,,,,-0.0024000
VDGSESEEETEEMIFGSSEAAK,ph,S,632,true,"LAXIC - ABA stress",84a,23660473,XCorr,5.9300000,1.0000000,,,,0.0005315970047377,
VDGSESEEETEEMIFGSSEAAK,ph,S,632,true,"SnRK2 protein kinase substrates",85,23776212,XCorr,5.7630887,1.0000000,,,,0.0022152198944241,
VDGSESEEETEEMIFGSSEAAK,ph,S,632,true,"atm and atr DNA damage response",88,25561503,"MASCOT Score",62.0000000,0.9940000,,,,,0.8600000
VDGSESEEETEEMIFGSSEAAK,ph,S,632,true,"TOR Kinase and ABA Receptor",100,29290610,XCorr,7.1752772,1.0000000,,,,2.1569999120175E-8,
VDGSESEEETEEMIFGSSEAAK,ph,S,632,true,"Lateral root-induction - NAA vs control",106,23328941,"MASCOT Score",65.0000000,,,,,,
VDGSESEEETEEMIFGSSEAAK,ph,S,632,true,"Phosphorylation tonoplast membrane fraction",107,18686298,"MASCOT Score",64.0000000,,,,,,
VDGSESEEETEEMIFGSSEAAK,ph,S,632,true,"Tissue atlas Arabidopsis - ProteomicsDB",114,32188942,"MaxQuant score",474.2700000,1.0000000,,,,0,
EVDQEPSGEGVTRVDGSESEEETEEMIFGSSEAAK,ph,T,636,true,"Brassinosteroid-Regulated Phosphorylation Dynamics",94,26187819,"MaxQuant Score",93.5680000,0.8800000,,,,3.0030001596515E-8,-0.3340000