Peptide,PTM,ModifiedAA,ModifiedPosition,PeptideUniqueToGene,ExperimentDesc,ExpID,PubmedID,ScoreType,IdentScore,LocProb,Log2FChange,PQ-val,QuantSig,PEP,MassErrorPPM
DTKVNLDPEGVFDFSAK,ub,K,29,true,"upl3 mutant / wildtype",168,35926874,"MaxQuant score",75.6820000,1.0000000,-1.2653446,0.1018420,NO,0.00016204100393225,-0.7333500
GVFDFSAKVGPE,nt,G,36,true,"Arabidopsis translation initiation landscape - NT",167b,35069635,,,,,,,,
SIFCIIEK,ph,S,74,true,"Tissue atlas Arabidopsis - ProteomicsDB",114,32188942,"MaxQuant score",99.9730000,1.0000000,,,,0.0051290499977767,
SIFCIIEK,acy,C,77,true,"Arabidopsis S-acylation atlas - Meristem",163a,35681017,,,,,,,,
SIFCIIEK,so,C,77,true,"S-sulfenylation site detection using YAP1C",110,32714340,,,,,,,,
SIFCIIEKAEPER,ub,K,81,true,"Arabidopsis ubiquitination COFRADIC",40,26744219,"MaxQuant Score",52.5270000,1.0000000,,,,1.9130000509904E-5,-0.1720000
GGMGGMGGMGGLE,nt,G,163,true,"Arg/N-end rule seed, prt6 vs. Wt",99,29168982,"MASCOT Score",62.4500000,,-0.4541275,0.0333680,NO,7.4770000537683E-6,-1.1455722
LMGGMGGMGGMGGLEGLGGMGGMGGMGGMGGMGGMEEFEDSDDEEETAK,ph,S,201,true,"Chloroplast kinase substrates",60,19376835,"MASCOT Score",34.1100000,,,,,,-0.6305440
LMGGMGGMGGMGGLEGLGGMGGMGGMGGMGGMGGMEEFEDSDDEEETAK,ph,S,201,true,"TOR Kinase and ABA Receptor",100,29290610,XCorr,7.1835318,0.9996000,,,,7.998999684844E-9,
TEKAPAAEETTSVKEDK,nt,T,225,true,"Arabidopsis translation initiation landscape - NT",167b,35069635,,,,,,,,
KDDAVKEEGLATEK,ph,T,225,true,"Tissue atlas Arabidopsis - ProteomicsDB",114,32188942,"MaxQuant score",100.0700000,1.0000000,,,,0.00012599100591615,
AEETTSVKEDK,nt,A,231,true,"Metacaspase9 substrates - 35S:MC9 / mc9",51b,23964026,"MASCOT Score",63.0000000,,,,,,-1.7835625
EEGLATEKAPAAEETTSVKEDK,ph,T,234,true,"Tissue atlas Arabidopsis - ProteomicsDB",114,32188942,"MaxQuant score",168.4500000,0.8326290,,,,1.4012984643248E-44,
APAAEETTSVKEDK,ph,T,235,true,"Tissue atlas Arabidopsis - ProteomicsDB",114,32188942,"MaxQuant score",228.8000000,0.8633110,,,,0,
APAAEETTSVKEDK,ph,S,236,true,"atm and atr DNA damage response",88,25561503,"MASCOT Score",61.0000000,0.9480000,,,,,-0.7100000
APAAEETTSVKEDK,ph,S,236,true,"Phospho cell culture sucrose/TOR",109,30833711,,,0.7985670,,,,,
APAAEETTSVKEDK,ph,S,236,true,"Tissue atlas Arabidopsis - ProteomicsDB",114,32188942,"MaxQuant score",287.8500000,0.9939080,,,,0,
