Peptide,PTM,ModifiedAA,ModifiedPosition,PeptideUniqueToGene,ExperimentDesc,ExpID,PubmedID,ScoreType,IdentScore,LocProb,Log2FChange,PQ-val,QuantSig,PEP,MassErrorPPM
RPLNSDEDDDEIDSDDENVDLYEYEEGVPEEESK,ph,S,40,true,"SnRK2 protein kinase substrates",85,23776212,XCorr,3.9134107,0.9770000,,,,1.6923300094618E-8,
RPLNSDEDDDEIDSDDENVDLYEYEEGVPEEESK,ph,S,40,true,"TOR Kinase and ABA Receptor",100,29290610,XCorr,5.3062224,0.9710000,,,,3.963999915868E-5,
RPLNSDEDDDEIDSDDENVDLYEYEEGVPEEESKK,ph,S,49,true,"SnRK2 protein kinase substrates",85,23776212,XCorr,3.3693373,0.9790000,,,,0.013836699537933,
RPLNSDEDDDEIDSDDENVDLYEYEEGVPEEESK,ph,S,49,true,"SnRK2 protein kinase substrates",85,23776212,XCorr,3.9134107,0.8880000,,,,1.6923300094618E-8,
RPLNSDEDDDEIDSDDENVDLYEYEEGVPEEESK,ph,S,49,true,"TOR Kinase and ABA Receptor",100,29290610,XCorr,5.9075160,0.9999000,,,,8.9689997651021E-8,
KDSDNFYDNSDSDNDMEGIENNDLGAVGDTASPAR,ph,S,562,true,"SnRK2 protein kinase substrates",85,23776212,XCorr,3.1521597,0.8140000,,,,0.025735499337316,
ESRDEESEDSESEAEQMVDGILTSASK,ph,S,629,true,"SnRK2 protein kinase substrates",85,23776212,XCorr,3.2893043,0.8310000,,,,3.96250006599E-16,
ESRDEESEDSESEAEQMVDGILTSASK,ph,S,634,true,"srk2dei ABA signaling phopshoproteomics",83,23572148,"MASCOT Score",22.0000000,,,,,,-0.0024000
ESRDEESEDSESEAEQMVDGILTSASK,ph,S,634,true,"SnRK2 protein kinase substrates",85,23776212,XCorr,3.2893043,0.8310000,,,,3.96250006599E-16,
ESRDEESEDSESEAEQMVDGILTSASK,ph,S,634,true,"TOR Kinase and ABA Receptor",100,29290610,XCorr,4.5425501,0.8913000,,,,7.0189998950809E-5,
ESRDEESEDSESEAEQMVDGILTSASK,ph,S,637,true,"srk2dei ABA signaling phopshoproteomics",83,23572148,"MASCOT Score",22.0000000,,,,,,-0.0024000
ESRDEESEDSESEAEQMVDGILTSASK,ph,S,637,true,"TOR Kinase and ABA Receptor",100,29290610,XCorr,4.5425501,0.8913000,,,,7.0189998950809E-5,
ESRDEESEDSESEAEQMVDGILTSASK,ph,S,639,true,"srk2dei ABA signaling phopshoproteomics",83,23572148,"MASCOT Score",22.0000000,,,,,,-0.0024000
ESRDEESEDSESEAEQMVDGILTSASK,ph,S,639,true,"TOR Kinase and ABA Receptor",100,29290610,XCorr,4.5425501,0.8913000,,,,7.0189998950809E-5,
EHEDANKKR,ub,K,728,true,"Arabidopsis ubiquitination COFRADIC",40,26744219,"MaxQuant Score",166.0700000,1.0000000,,,,2.3580069648733E-40,-0.0160000
EHEDANKKR,ub,K,729,true,"Arabidopsis ubiquitination COFRADIC",40,26744219,"MaxQuant Score",166.0700000,1.0000000,,,,2.3580069648733E-40,-0.0160000
KLDLKTR,ub,K,735,true,"Arabidopsis ubiquitination COFRADIC",40,26744219,"MaxQuant Score",57.5900000,1.0000000,,,,0.026000000536442,0.5420000
ADDENPRSHQK,ph,S,828,true,"Tissue atlas Arabidopsis - ProteomicsDB",114,32188942,"MaxQuant score",43.8130000,1.0000000,,,,0.014767199754715,
