Peptide,PTM,ModifiedAA,ModifiedPosition,PeptideUniqueToGene,ExperimentDesc,ExpID,PubmedID,ScoreType,IdentScore,LocProb,Log2FChange,PQ-val,QuantSig,PEP,MassErrorPPM
MQSSKGRRKVGSTTAGAGIDSAEKLDE,nta,M,1,true,"HUNTER N-terminome: legumain, GluC and trypsin",119,31951383,"MaxQuant score",90.0970000,,,,,,
MQSSKGRRKVGSTTAGAGIDSAEKLDE,nta,M,1,true,"Arabidopsis translation initiation landscape - NTA",167a,35069635,,,,,,,,
MQSSKGRRKVGSTTAGAGIDSAE,nta,M,1,true,"HUNTER N-terminome: legumain, GluC and trypsin",119,31951383,"MaxQuant score",,,,,,,
VGSTTAGAGIDSAEK,ph,S,21,true,"TOR Kinase and ABA Receptor",100,29290610,XCorr,4.0306463,0.9989000,,,,2.669999958016E-5,
LDELLISSAICNGEDLGPFVR,sno,C,35,true,"hot5-4 / wildtype, FAT-switch S-nitrosoproteome",169,37277371,,,,,,,,
NVDLAIGAVTHCVR,so,C,144,true,"Arabidopsis S-sulfenylation chemoproteomics",108,31578252,"pFind PSM Score",0.0002295,,1.8543900,,,,0.2315102
MCAVLEDQFSR,sno,C,364,true,"hot5-4 / wildtype, FAT-switch S-nitrosoproteome",169,37277371,,,,0.4387751,0.0424129,NO,,
IVGTLCGDLVK,sno,C,663,true,"hot5-4 / wildtype, FAT-switch S-nitrosoproteome",169,37277371,,,,,,,,
ERSYNALDYRK,ph,S,735,true,"TOR Kinase and ABA Receptor",100,29290610,XCorr,2.8960769,0.9184000,,,,6.1669998103753E-5,
ERSYNALDYR,ph,S,735,true,"atm and atr DNA damage response",88,25561503,"MASCOT Score",35.0000000,0.9970000,,,,,0.1600000
ERSYNALDYR,ph,S,735,true,"Tissue atlas Arabidopsis - ProteomicsDB",114,32188942,"MaxQuant score",195.8700000,1.0000000,,,,1.5373699492269E-13,
FRDPSDSIFGTFGTR,ph,T,761,true,"atm and atr DNA damage response",88,25561503,"MASCOT Score",31.0000000,1.0000000,,,,,-0.6600000
FRDPSDSIFGTFGTR,ph,T,761,true,"TOR Kinase and ABA Receptor",100,29290610,XCorr,3.9236424,1.0000000,,,,5.7010001910385E-6,
FRDPSDSIFGTFGTR,ph,T,761,true,"Phospho cell culture sucrose/TOR",109,30833711,,,0.9617500,,,,,
FRDPSDSIFGTFGTR,ph,T,761,true,"Tissue atlas Arabidopsis - ProteomicsDB",114,32188942,"MaxQuant score",272.0900000,0.9998580,,,,0,
DPSDSIFGTFGTR,ph,T,761,true,"atm and atr DNA damage response",88,25561503,"MASCOT Score",44.0000000,1.0000000,,,,,-0.0600000
FRDPSDSIFGTFGTR,ph,T,764,true,"atm and atr DNA damage response",88,25561503,"MASCOT Score",31.0000000,1.0000000,,,,,-0.6600000
FRDPSDSIFGTFGTR,ph,T,764,true,"Tissue atlas Arabidopsis - ProteomicsDB",114,32188942,"MaxQuant score",74.0290000,0.9999990,,,,0.0002293580037076,
DPSDSIFGTFGTR,ph,T,764,true,"atm and atr DNA damage response",88,25561503,"MASCOT Score",44.0000000,1.0000000,,,,,-0.0600000
NKSLDALIK,ph,S,775,true,"atm and atr DNA damage response",88,25561503,"MASCOT Score",29.0000000,1.0000000,,,,,-2.0900000
NKSLDALIK,ph,S,775,true,"Tissue atlas Arabidopsis - ProteomicsDB",114,32188942,"MaxQuant score",146.0800000,1.0000000,,,,0.00022504100343212,
SLDALIKR,ac,K,781,true,"Quantitative Acetylproteomics",101,29440448,,,,,,,,
