Peptide,PTM,ModifiedAA,ModifiedPosition,PeptideUniqueToGene,ExperimentDesc,ExpID,PubmedID,ScoreType,IdentScore,LocProb,Log2FChange,PQ-val,QuantSig,PEP,MassErrorPPM
ADDGTDNPDVSDPHQQIPSEIKR,ph,T,108,true,"Large-scale phosphorylation discovery",44,23111157,XCorr,5.0200000,,,,,,
ADDGTDNPDVSDPHQQIPSEIKR,ph,T,108,true,"SnRK2 protein kinase substrates",85,23776212,XCorr,3.6520810,1.0000000,,,,0.003187210066244,
ADDGTDNPDVSDPHQQIPSEIKR,ph,T,108,true,"Phospho cell culture sucrose/TOR",109,30833711,,,1.0000000,,,,,
ADDGTDNPDVSDPHQQIPSEIKR,ph,T,108,true,"Tissue atlas Arabidopsis - ProteomicsDB",114,32188942,"MaxQuant score",264.6300000,1.0000000,,,,0,
ADDGTDNPDVSDPHQQIPSEIK,ph,T,108,true,"TOR Kinase and ABA Receptor",100,29290610,XCorr,5.2002735,1.0000000,,,,3.8760001075389E-7,
GDVHICLMGDPGVAK,so,C,373,true,"Arabidopsis S-sulfenylation chemoproteomics",108,31578252,"pFind PSM Score",0.0214166,,1.2868800,,,,-0.9663895
GDVHICLMGDPGVAK,so,C,373,true,"S-sulfenylation site detection using YAP1C",110,32714340,,,,,,,,
TLLSILRISAALAR,ph,T,601,true,"Conserved plant phosphoproteome - Arabidopsis",61a,20466843,"MASCOT Score",24.0000000,1.0000000,,,,,
TLLSILRISAALAR,ph,S,604,true,"Conserved plant phosphoproteome - Arabidopsis",61a,20466843,"MASCOT Score",24.0000000,1.0000000,,,,,
