Peptide,PTM,ModifiedAA,ModifiedPosition,PeptideUniqueToGene,ExperimentDesc,ExpID,PubmedID,ScoreType,IdentScore,LocProb,Log2FChange,PQ-val,QuantSig,PEP,MassErrorPPM
SLGGLLSGIFKGSDNGESTR,nt,S,73,true,"N-terminal ChaFRADIC",92,26010716,"MASCOT Score",40.5500000,,,,,6.0249999478401E-7,
SLGGLLSGIFKGSDNGE,nt,S,73,true,"N-terminal ChaFRADIC",92,26010716,"MASCOT Score",43.8600000,,,,,0.0005020999815315,
SLGGLLSGIFKGSDNGESTR,nta,S,73,true,"N-terminal ChaFRADIC",92,26010716,"MASCOT Score",40.5500000,,,,,6.0249999478401E-7,
SLGGLLSGIFKGSDNGESTR,nta,S,73,true,"HUNTER N-terminome: legumain, GluC and trypsin",119,31951383,"MaxQuant score",56.5400000,,,,,,
SLGGLLSGIFKGSDNGE,nta,S,73,true,"N-terminal ChaFRADIC",92,26010716,"MASCOT Score",43.8600000,,,,,0.0005020999815315,
SLGGLLSGIFK,nta,S,73,true,"Characterization plant N-terminal acetylation",6,22223895,"MASCOT Score",51.4200000,,,,,,
QQYASIVASVNR,nt,Q,93,true,"HUNTER N-terminome: legumain, GluC and trypsin",119,31951383,"MaxQuant score",149.2300000,,,,,,
DAYLQKR,ac,K,896,true,"Quantitative Acetylproteomics",101,29440448,,,,,,,,
