Peptide,PTM,ModifiedAA,ModifiedPosition,PeptideUniqueToGene,ExperimentDesc,ExpID,PubmedID,ScoreType,IdentScore,LocProb,Log2FChange,PQ-val,QuantSig,PEP,MassErrorPPM
SVAGGPTVGSSKIEGGGGTTITTD,nt,S,35,true,"HUNTER N-terminome: legumain, GluC and trypsin",119,31951383,"MaxQuant score",103.2100000,,,,,,
SVAGGPTVGSSKIE,nt,S,35,true,"N-terminal ChaFRADIC",92,26010716,"MASCOT Score",36.8600000,,,,,0.0053220000118017,
SVAGGPTVGSSKIE,nt,S,35,true,"Arg/N-end rule seed, prt6 vs. Wt",99,29168982,"MASCOT Score",47.1600000,,0.3113782,0.1480440,NO,3.4479999158066E-6,-1.3703767
SVAGGPTVGSSKIE,nt,S,35,true,"HUNTER N-terminome: legumain, GluC and trypsin",119,31951383,"MaxQuant score",118.4800000,,,,,,
SVAGGPTVGSSKIE,nta,S,35,true,"N-terminal ChaFRADIC",92,26010716,"MASCOT Score",36.8600000,,,,,0.0053220000118017,
SVAGGPTVGSSKIE,nta,S,35,true,"Arg/N-end rule seed, prt6 vs. Wt",99,29168982,"MASCOT Score",47.1600000,,-0.0325178,0.8050996,NO,3.4479999158066E-6,-1.3703767
SVAGGPTVGSSKIE,nta,S,35,true,"HUNTER N-terminome: legumain, GluC and trypsin",119,31951383,"MaxQuant score",110.6600000,,,,,,
SVAGGPTVGSSK,nta,S,35,true,"Characterization plant N-terminal acetylation",6,22223895,"MASCOT Score",75.6200000,,,,,,
VAGGPTVGSSKIE,nt,V,36,true,"N-terminal ChaFRADIC",92,26010716,"MASCOT Score",20.6300000,,,,,0.0013999999500811,
VAGGPTVGSSKIE,nta,V,36,true,"N-terminal ChaFRADIC",92,26010716,"MASCOT Score",20.6300000,,,,,0.0013999999500811,
AAFGKVWK,ac,K,234,true,"Histone deacetylases - apicidin vs control",98a,29061669,"MaxQuant Score",130.3000000,1.0000000,0.0080000,0.9727472,NO,4.200000047661E-18,
AAFGKVWK,ac,K,234,true,"Histone deacetylases substrates - TSA vs control",98b,29061669,"MaxQuant Score",130.3000000,1.0000000,-0.3040000,0.9794900,NO,4.200000047661E-18,
AAFGKVWK,ac,K,234,true,"Histone deacetylases- hda14 vs WT (low light)",98c,29061669,"MaxQuant Score",103.8300000,1.0000000,0.2240000,0.9885531,NO,0.041000001132488,
AAFGKVWK,ac,K,234,true,"Histone deacetylases - hda14 vs WT (thylakoids)",98d,29061669,"MaxQuant Score",95.9000000,1.0000000,0.0990000,0.9749896,NO,0.012000000104308,
AAFGKVWK,ac,K,234,true,"Histone deacetylases substrates - hda14 vs WT",98e,29061669,"MaxQuant Score",96.5000000,1.0000000,0.3470000,0.2897344,NO,0.0020000000949949,
AAFGKVWK,ac,K,234,true,"Quantitative Acetylproteomics",101,29440448,,,,,,,,
QNGGSIIGGTFKAIQE,nt,Q,240,true,"HUNTER N-terminome: legumain, GluC and trypsin",119,31951383,"MaxQuant score",121.5600000,,,,,,
LPKPQGQTVGSFR,ph,T,275,true,"Tyrosine phosphorylation in Arabidopsis",59,18463617,"MASCOT Score",22.0000000,,,,,,-0.8033538
LPKPQGQTVGSFR,ph,S,278,true,"srk2dei ABA signaling phopshoproteomics",83,23572148,"MASCOT Score",24.0000000,,,,,,-0.0029000
YIGGSTNTGILSKSE,nt,Y,426,true,"Arg/N-end rule seed, prt6 vs. Wt",99,29168982,"MASCOT Score",41.6100000,,-0.8401224,0.1258173,NO,0.0005696999724023,-0.5434128
