Peptide,PTM,ModifiedAA,ModifiedPosition,PeptideUniqueToGene,ExperimentDesc,ExpID,PubmedID,ScoreType,IdentScore,LocProb,Log2FChange,PQ-val,QuantSig,PEP,MassErrorPPM
SAESCFGSSGDQSSSKGVATHGGSYVQYNVYGNLFEVSR,nta,S,2,true,"HUNTER N-terminome: legumain, GluC and trypsin",119,31951383,"MaxQuant score",107.0400000,,,,,,
SAESCFGSSGDQSSSKGVATHGGSYVQYN,nta,S,2,true,"HUNTER N-terminome: legumain, GluC and trypsin",119,31951383,"MaxQuant score",41.1880000,,,,,,
SAESCFGSSG,nta,S,2,true,"Arabidopsis translation initiation landscape - NTA",167a,35069635,,,,,,,,
SAESCFGSSGDQSSSK,ph,S,2,true,"atm and atr DNA damage response",88,25561503,"MASCOT Score",65.0000000,0.9380000,,,,,-0.5200000
SAESCFGSSGDQSSSK,so,C,6,true,"S-sulfenylation site detection using YAP1C",110,32714340,,,,,,,,
GAYGIVCAATNSETGEEVAIKK,so,C,58,true,"S-sulfenylation site detection using YAP1C",110,32714340,,,,,,,,
IGNAFDNIIDAKR,ac,K,85,false,"Quantitative Acetylproteomics",101,29440448,,,,,,,,
SNQPLTDDHCR,sno,C,146,true,"Site-specific nitrosomeproteomic id - gsnor1-3",90a,25699590,XCorr,2.1016724,,,,,0.0084269996732473,-5.4480984
SNQPLTDDHCR,so,C,146,true,"Arabidopsis S-sulfenylation chemoproteomics",108,31578252,"pFind PSM Score",0.0376661,,1.3216400,,,,0.4625252
DLKPSNLLLNANCDLK,ox,C,181,false,"SPEAR - 10 mM H2O2 / mock",138a,34619326,,,,1.7887156,0.0397313,YES,,
DLKPSNLLLNANCDLK,ox,C,181,false,"SPEAR - 50 mM H2O2 / mock",138b,34619326,,,,1.1280805,0.0439755,YES,,
DLKPSNLLLNANCDLK,sno,C,181,false,"Site-specific nitrosomeproteomic id - gsnor1-3",90b,25699590,XCorr,3.4100000,,,,,0.087520003318787,-7.4900000
DLKPSNLLLNANCDLK,sno,C,181,false,"hot5-4 / wildtype, FAT-switch S-nitrosoproteome",169,37277371,,,,,,,,
DLKPSNLLLNANCDLK,so,C,181,false,"Arabidopsis S-sulfenylation chemoproteomics",108,31578252,"pFind PSM Score",0.2134640,,1.4285700,,,,-0.5714751
DLKPSNLLLNANCDLK,so,C,181,false,"S-sulfenylation site detection using YAP1C",110,32714340,,,,,,,,
TKSETDFMTEYVVTR,ph,T,193,false,"srk2dei ABA signaling phopshoproteomics",83,23572148,"MASCOT Score",36.0000000,,,,,,-0.0032000
TKSETDFMTEYVVTR,ph,S,195,false,"SnRK2 protein kinase substrates",85,23776212,XCorr,2.8319049,0.9320000,,,,0.0077178901992738,
TKSETDFMTEYVVTR,ph,S,195,false,"atm and atr DNA damage response",88,25561503,"MASCOT Score",54.0000000,0.9930000,,,,,-0.3900000
TKSETDFMTEYVVTR,ph,S,195,false,"Tissue atlas Arabidopsis - ProteomicsDB",114,32188942,"MaxQuant score",227.5700000,0.9997550,,,,0,
SETDFMTEYVVTR,ph,T,197,false,"srk2dei ABA signaling phopshoproteomics",83,23572148,"MASCOT Score",49.0000000,,,,,,0.0005000
TKSETDFMTEYVVTR,ph,T,201,false,"atm and atr DNA damage response",88,25561503,"MASCOT Score",43.0000000,1.0000000,,,,,-1.4100000
TKSETDFMTEYVVTR,ph,T,201,false,"Tissue atlas Arabidopsis - ProteomicsDB",114,32188942,"MaxQuant score",280.1900000,1.0000000,,,,0,
SETDFMTEYVVTR,ph,T,201,false,"srk2dei ABA signaling phopshoproteomics",83,23572148,"MASCOT Score",56.0000000,,,,,,-0.0009000
SETDFMTEYVVTR,ph,T,201,false,"atm and atr DNA damage response",88,25561503,"MASCOT Score",70.0000000,1.0000000,,,,,-0.2500000
SETDFMTEYVVTR,ph,T,201,false,"Brassinosteroid-Regulated Phosphorylation Dynamics",94,26187819,"MaxQuant Score",140.4600000,1.0000000,,,,4.7850000555627E-5,1.3270000
SETDFMTEYVVTR,ph,T,201,false,"TOR Kinase and ABA Receptor",100,29290610,XCorr,4.0557938,0.9302000,,,,4.0750001062406E-5,
SETDFMTEYVVTR,ph,T,201,false,"Phospho cell culture sucrose/TOR",109,30833711,,,0.9998700,,,,,
TKSETDFMTEYVVTR,ph,Y,203,false,"atm and atr DNA damage response",88,25561503,"MASCOT Score",43.0000000,1.0000000,,,,,-1.4100000
TKSETDFMTEYVVTR,ph,Y,203,false,"Tissue atlas Arabidopsis - ProteomicsDB",114,32188942,"MaxQuant score",266.9900000,0.9999760,,,,0,
SETDFMTEYVVTR,ph,Y,203,false,"Tyrosine phosphorylation in Arabidopsis",59,18463617,"MASCOT Score",69.0000000,,,,,,-1.6297740
SETDFMTEYVVTR,ph,Y,203,false,"srk2dei ABA signaling phopshoproteomics",83,23572148,"MASCOT Score",56.0000000,,,,,,-0.0009000
SETDFMTEYVVTR,ph,Y,203,false,"atm and atr DNA damage response",88,25561503,"MASCOT Score",70.0000000,1.0000000,,,,,-0.2500000
SETDFMTEYVVTR,ph,Y,203,false,"Brassinosteroid-Regulated Phosphorylation Dynamics",94,26187819,"MaxQuant Score",140.4600000,1.0000000,,,,4.7850000555627E-5,1.3270000
SETDFMTEYVVTR,ph,Y,203,false,"Tyrosine phosphorylation - flg22 vs mock",105,22074104,"MASCOT Score",37.0000000,,3.7100000,,YES,,
SETDFMTEYVVTR,ph,Y,203,false,"Phospho cell culture sucrose/TOR",109,30833711,,,0.9967870,,,,,
ETVKFNPQDSV,ph,S,375,true,"Tissue atlas Arabidopsis - ProteomicsDB",114,32188942,"MaxQuant score",72.7310000,0.9999940,,,,0.00420803995803,
