Peptide,PTM,ModifiedAA,ModifiedPosition,PeptideUniqueToGene,ExperimentDesc,ExpID,PubmedID,ScoreType,IdentScore,LocProb,Log2FChange,PQ-val,QuantSig,PEP,MassErrorPPM
LTYEEALQQSMTTSSSFDSD,nt,L,70,true,"HUNTER N-terminome: legumain, GluC and trypsin",119,31951383,"MaxQuant score",184.9800000,,,,,,
LTYEEALQQSMTTSSSFD,nt,L,70,true,"HUNTER N-terminome: legumain, GluC and trypsin",119,31951383,"MaxQuant score",57.8020000,,,,,,
LTYEEALQQS,nt,L,70,true,"N-terminal ChaFRADIC",92,26010716,"MASCOT Score",61.7600000,,,,,7.4539997285683E-8,
LTYEEALQQ,nt,L,70,true,"N-terminal ChaFRADIC",92,26010716,"MASCOT Score",73.3300000,,,,,4.6149998524925E-6,
MTTSSSFDSDGLIE,nt,M,80,true,"N-terminal ChaFRADIC",92,26010716,"MASCOT Score",70.7300000,,,,,4.0139998418454E-6,
TTSSSFDSDGLIE,nt,T,81,true,"N-terminal ChaFRADIC",92,26010716,"MASCOT Score",83.6700000,,,,,9.5650002549519E-6,
SSFDSDGLIE,nt,S,84,true,"N-terminal ChaFRADIC",92,26010716,"MASCOT Score",79.3200000,,,,,0.00033030001213774,
KPKSWGVESAK,ac,K,128,true,"Quantitative Acetylproteomics",101,29440448,,,,,,,,
SWGVESAKNAYTK,ac,K,136,true,"Histone deacetylases - hda14 vs WT (thylakoids)",98d,29061669,"MaxQuant Score",81.6000000,1.0000000,0.0490000,0.9862795,NO,9.2599999334197E-5,
SWGVESAKNAYTK,ac,K,136,true,"Quantitative Acetylproteomics",101,29440448,,,,,,,,
NAYTKLGTDDNAQLLDIR,ac,K,141,true,"Histone deacetylases - apicidin vs control",98a,29061669,"MaxQuant Score",82.9000000,1.0000000,-0.0160000,0.9354057,NO,7.0000002159749E-14,
QVGSPNIK,ph,S,164,true,"atm and atr DNA damage response",88,25561503,"MASCOT Score",36.0000000,1.0000000,,,,,-2.0600000
QVGSPNIKGLGK,ac,K,168,true,"Histone deacetylases - hda14 vs WT (thylakoids)",98d,29061669,"MaxQuant Score",71.2000000,1.0000000,-0.0040000,0.9977001,NO,0.0020000000949949,
QVGSPNIKGLGK,ac,K,168,true,"Quantitative Acetylproteomics",101,29440448,,,,,,,,
AVSTVYNGEDKPGFLK,ph,T,177,true,"Tissue atlas Arabidopsis - ProteomicsDB",114,32188942,"MaxQuant score",156.9600000,0.9963100,,,,6.7432501639833E-13,
AVSTVYNGEDKPGFLK,ac,K,184,true,"Histone deacetylases - apicidin vs control",98a,29061669,"MaxQuant Score",45.6000000,1.0000000,0.1660000,0.4886524,NO,2.8000000384054E-5,
AVSTVYNGEDKPGFLKK,ac,K,189,true,"Quantitative Acetylproteomics",101,29440448,,,,,,,,
FKDPENTTLYILDK,ac,K,196,true,"Histone deacetylases - hda14 vs WT (thylakoids)",98d,29061669,"MaxQuant Score",48.2000000,1.0000000,0.9130000,0.4931738,NO,0.014000000432134,
SAYAIKDGAEGPR,ac,K,232,true,"Histone deacetylases - apicidin vs control",98a,29061669,"MaxQuant Score",63.2000000,1.0000000,0.0330000,0.8609938,NO,0.003000000026077,
SAYAIKDGAEGPR,ac,K,232,true,"Histone deacetylases - hda14 vs WT (thylakoids)",98d,29061669,"MaxQuant Score",86.9000000,1.0000000,0.1690000,0.8892011,NO,2.0999999833293E-5,
SAYAIKDGAEGPR,ac,K,232,true,"Quantitative Acetylproteomics",101,29440448,,,,,,,,
GWLNSSLPWIEPKK,ac,K,252,true,"Histone deacetylases - hda14 vs WT (thylakoids)",98d,29061669,"MaxQuant Score",123.8000000,1.0000000,0.6450000,0.3507519,NO,2.6800000796356E-7,
KLLFAEDR,ac,K,316,true,"Histone deacetylases - apicidin vs control",98a,29061669,"MaxQuant Score",123.4000000,1.0000000,-0.0520000,0.7379042,NO,0.0070000002160668,
KLLFAEDR,ac,K,316,true,"Histone deacetylases - hda14 vs WT (thylakoids)",98d,29061669,"MaxQuant Score",92.8000000,1.0000000,0.1990000,0.9268298,NO,0.019999999552965,
QTLKQVDEFLNTK,ac,K,328,true,"Histone deacetylases substrates - hda14 vs WT",98e,29061669,"MaxQuant Score",44.3000000,1.0000000,1.4600000,0.1270574,NO,0.003000000026077,
QVDEFLNTKVAPK,ac,K,337,true,"Histone deacetylases - apicidin vs control",98a,29061669,"MaxQuant Score",62.5000000,1.0000000,0.2440000,0.1866380,NO,0.0004600000102073,
QVDEFLNTKVAPK,ac,K,337,true,"Histone deacetylases - hda14 vs WT (thylakoids)",98d,29061669,"MaxQuant Score",105.1000000,1.0000000,0.5510000,0.4385307,NO,2.739999899859E-6,
QVDEFLNTKVAPK,ac,K,337,true,"Quantitative Acetylproteomics",101,29440448,,,,,,,,
ELVDELKEIGK,ac,K,348,true,"Histone deacetylases - apicidin vs control",98a,29061669,"MaxQuant Score",98.1000000,1.0000000,0.1340000,0.5610480,NO,0.003000000026077,
ELVDELKEIGK,ac,K,348,true,"Histone deacetylases- hda14 vs WT (low light)",98c,29061669,"MaxQuant Score",101.3000000,1.0000000,2.4280000,0.2642409,NO,0.0020000000949949,
ELVDELKEIGK,ac,K,348,true,"Histone deacetylases - hda14 vs WT (thylakoids)",98d,29061669,"MaxQuant Score",168.0000000,1.0000000,0.9930000,0.4797334,NO,4.6700001426057E-19,
ELVDELKEIGK,ac,K,348,true,"Histone deacetylases substrates - hda14 vs WT",98e,29061669,"MaxQuant Score",63.1000000,1.0000000,2.4580000,0.0210863,YES,0.0010000000474975,
ALPAPATVTAEAE,nt,A,363,true,"N-terminal ChaFRADIC",92,26010716,"MASCOT Score",50.5200000,,,,,0.070670001208782,
