Peptide,PTM,ModifiedAA,ModifiedPosition,PeptideUniqueToGene,ExperimentDesc,ExpID,PubmedID,ScoreType,IdentScore,LocProb,Log2FChange,PQ-val,QuantSig,PEP,MassErrorPPM
LKSIASGR,ph,S,9,true,"atm and atr DNA damage response",88,25561503,"MASCOT Score",37.0000000,0.9280000,,,,,-0.6800000
LKSIASGR,ph,S,9,true,"Tissue atlas Arabidopsis - ProteomicsDB",114,32188942,"MaxQuant score",100.9200000,1.0000000,,,,0.0092244297266006,
LKSIASGR,ph,S,12,true,"atm and atr DNA damage response",88,25561503,"MASCOT Score",21.0000000,1.0000000,,,,,-0.7500000
LKSIASGR,ph,S,12,true,"Tissue atlas Arabidopsis - ProteomicsDB",114,32188942,"MaxQuant score",73.2120000,1.0000000,,,,0.00010766299965326,
SIASGRTSISSDPGGDYALKR,ph,T,15,true,"Tissue atlas Arabidopsis - ProteomicsDB",114,32188942,"MaxQuant score",73.2120000,0.7769230,,,,0.00010766299965326,
TSISSDPGGDYALK,ph,S,19,true,"Tissue atlas Arabidopsis - ProteomicsDB",114,32188942,"MaxQuant score",167.8900000,0.9965770,,,,1.3938400426729E-15,
GEPNISYICSR,ph,S,297,false,"atm and atr DNA damage response",88,25561503,"MASCOT Score",25.0000000,0.9950000,,,,,-0.0700000
GEPNISYICSR,ph,S,297,false,"Lateral root-induction - NAA vs control",106,23328941,"MASCOT Score",28.0000000,,,,,,
GEPNISYICSR,ph,S,297,false,"Tissue atlas Arabidopsis - ProteomicsDB",114,32188942,"MaxQuant score",134.2300000,0.7862990,,,,2.6573300146993E-6,
MLVPGEPNISYICSR,ph,Y,298,true,"Large-scale phosphorylation discovery",44,23111157,XCorr,3.9250000,,,,,,
MLVPGEPNISYICSR,ph,Y,298,true,"SnRK2 protein kinase substrates",85,23776212,XCorr,2.8771272,0.9910000,,,,0.0094229197129607,
MLVPGEPNISYICSR,ph,Y,298,true,"Tyrosine phosphorylation - flg22 vs mock",105,22074104,"MASCOT Score",71.3600000,,,,,,-3.4009077
MLVPGEPNISYICSR,ph,Y,298,true,"Tissue atlas Arabidopsis - ProteomicsDB",114,32188942,"MaxQuant score",150.6800000,0.9432520,,,,2.8734399748487E-8,
GEPNISYICSR,ph,Y,298,false,"Large-scale phosphorylation discovery",44,23111157,XCorr,3.4240000,,,,,,
GEPNISYICSR,ph,Y,298,false,"PAMP-triggered phosphorylation",48,24601666,"MASCOT Score",50.0100000,,,,,,
GEPNISYICSR,ph,Y,298,false,"Tyrosine phosphorylation in Arabidopsis",59,18463617,"MASCOT Score",69.0000000,,,,,,-0.5092527
GEPNISYICSR,ph,Y,298,false,"srk2dei ABA signaling phopshoproteomics",83,23572148,"MASCOT Score",66.0000000,,,,,,0.0000000
GEPNISYICSR,ph,Y,298,false,"LAXIC - ABA stress",84a,23660473,XCorr,3.0500000,0.9720000,,,,0.00018906999321189,
GEPNISYICSR,ph,Y,298,false,"LAXIC - mannitol vs control",84b,23660473,XCorr,2.4100000,0.9710000,,,,0.00085039797704667,
GEPNISYICSR,ph,Y,298,false,"SnRK2 protein kinase substrates",85,23776212,XCorr,2.3066299,1.0000000,,,,0.012988200411201,
GEPNISYICSR,ph,Y,298,false,"atm and atr DNA damage response",88,25561503,"MASCOT Score",49.0000000,0.9630000,,,,,-1.0400000
GEPNISYICSR,ph,Y,298,false,"Brassinosteroid-Regulated Phosphorylation Dynamics",94,26187819,"MaxQuant Score",118.8700000,0.9570000,,,,0.0070000002160668,0.9110000
GEPNISYICSR,ph,Y,298,false,"TOR Kinase and ABA Receptor",100,29290610,XCorr,2.5206320,0.9397000,,,,0.010959999635816,
GEPNISYICSR,ph,Y,298,false,"Tyrosine phosphorylation - flg22 vs mock",105,22074104,"MASCOT Score",62.7000000,,0.0200000,,YES,,
GEPNISYICSR,ph,Y,298,false,"Lateral root-induction - NAA vs control",106,23328941,"MASCOT Score",28.0000000,,,,,,
GEPNISYICSR,ph,Y,298,false,"Phospho cell culture sucrose/TOR",109,30833711,,,0.7943320,,,,,
GEPNISYICSR,ph,Y,298,false,"Col-0 callus - FC Col-0 vs. Col-0 Xray",111a,31410901,,43.4800000,,0.6720397,0.0000000,NO,,0.4903190
GEPNISYICSR,ph,Y,298,false,"Col-0 X-ray callus - FC Col-0 vs. Col-0 Xray",111b,31410901,,43.4800000,,0.6720397,0.0000000,NO,,0.4903190
GEPNISYICSR,ph,Y,298,false,"atm callus - FC atm vs. atm Xray",111c,31410901,,43.4800000,,0.4433674,0.0000000,NO,,0.4903190
GEPNISYICSR,ph,Y,298,false,"atm-3 X-ray callus - FC atm vs. atm Xray",111d,31410901,,43.4800000,,0.4433674,0.0000000,NO,,0.4903190
GEPNISYICSR,ph,Y,298,false,"Tissue atlas Arabidopsis - ProteomicsDB",114,32188942,"MaxQuant score",143.4000000,0.9571140,,,,1.958770070587E-7,
MLVPGEPNISYICSR,ph,S,301,true,"Tissue atlas Arabidopsis - ProteomicsDB",114,32188942,"MaxQuant score",110.8600000,0.8474710,,,,4.4200201045896E-6,
GEPNISYICSR,ph,S,301,false,"srk2dei ABA signaling phopshoproteomics",83,23572148,"MASCOT Score",38.0000000,,,,,,0.0008000
LIPAHCQGTGSSS,ox,C,465,true,"OxiTRAQ Arabidopsis - 5 mM H2O2 versus control",47,24376095,,,,0.0012871,0.3820685,NO,,
LIPAHCQGTGSSS,ph,S,472,true,"Tissue atlas Arabidopsis - ProteomicsDB",114,32188942,"MaxQuant score",91.9390000,0.7733830,,,,0.0003547329979483,
