Peptide,PTM,ModifiedAA,ModifiedPosition,PeptideUniqueToGene,ExperimentDesc,ExpID,PubmedID,ScoreType,IdentScore,LocProb,Log2FChange,PQ-val,QuantSig,PEP,MassErrorPPM
VKLRAESTEE,nt,V,52,true,"Arabidopsis translation initiation landscape - NT",167b,35069635,,,,,,,,
VKLRAESTEE,nta,V,52,true,"Arabidopsis translation initiation landscape - NTA",167a,35069635,,,,,,,,
AESTEEDRVPIDDDDDSTDQLVDEEIVHFEER,nt,A,56,true,"HUNTER N-terminome: legumain, GluC and trypsin",119,31951383,"MaxQuant score",143.8300000,,,,,,
AESTEEDRVPIDDDDDSTDQLVDEE,nt,A,56,true,"HUNTER N-terminome: legumain, GluC and trypsin",119,31951383,"MaxQuant score",98.7030000,,,,,,
AESTEEDRVPIDDDDDSTDQLVDEEIVHFEER,ph,S,72,true,"Tissue atlas Arabidopsis - ProteomicsDB",114,32188942,"MaxQuant score",388.4800000,0.8418180,,,,0,
EIGQSNPDIYFTDSAGR,ph,S,200,true,"Tissue atlas Arabidopsis - ProteomicsDB",114,32188942,"MaxQuant score",72.9320000,0.9998760,,,,0.00045658499584533,
NTECLTWGIDK,ox,C,217,true,"SPEAR - 10 mM H2O2 / mock",138a,34619326,,,,-2.1402285,0.0375015,YES,,
TALEVYFDYMR,ph,T,232,false,"Brassinosteroid-Regulated Phosphorylation Dynamics",94,26187819,"MaxQuant Score",58.6760000,1.0000000,,,,0.035000000149012,2.3460000
TALEVYFDYMR,ph,Y,237,false,"Brassinosteroid-Regulated Phosphorylation Dynamics",94,26187819,"MaxQuant Score",58.6760000,1.0000000,,,,0.035000000149012,2.3460000
TALEVYFDYMR,ph,Y,240,false,"Brassinosteroid-Regulated Phosphorylation Dynamics",94,26187819,"MaxQuant Score",58.6760000,1.0000000,,,,0.035000000149012,2.3460000
IIPEIEVGLGPCGELR,sno,C,267,true,"Site-specific nitrosomeproteomic id - gsnor1-3",90a,25699590,XCorr,2.5465894,,,,,0.12929999828339,-3.9245631
IIPEIEVGLGPCGELR,sno,C,267,true,"Site-specific nitrosomeproteomic id - gsnor1-3",90b,25699590,XCorr,2.9500000,,,,,0.053739998489618,-5.8600000
HDAALNFTCVELR,ox,C,425,true,"SPEAR - 10 mM H2O2 / mock",138a,34619326,,,,5.4952312,0.0001669,YES,,
HDAALNFTCVELR,ox,C,425,true,"SPEAR - 50 mM H2O2 / mock",138b,34619326,,,,4.8635028,0.0122173,YES,,
KHDAALNFTCVELR,sno,C,425,true,"Site-specific nitrosomeproteomic id - gsnor1-3",90a,25699590,XCorr,2.6300000,,,,,0.07582999765873,-5.9700000
KHDAALNFTCVELR,sno,C,425,true,"Site-specific nitrosomeproteomic id - gsnor1-3",90b,25699590,XCorr,3.6400000,,,,,0.00031390000367537,-5.7900000
HDAALNFTCVELR,sno,C,425,true,"Site-specific nitrosomeproteomic id - gsnor1-3",90b,25699590,XCorr,2.9800000,,,,,0.0026680000592023,-6.6200000
HDAALNFTCVELR,so,C,425,true,"Arabidopsis S-sulfenylation chemoproteomics",108,31578252,"pFind PSM Score",0.0003806,,2.7777800,,,,-0.4368446
