Peptide,PTM,ModifiedAA,ModifiedPosition,PeptideUniqueToGene,ExperimentDesc,ExpID,PubmedID,ScoreType,IdentScore,LocProb,Log2FChange,PQ-val,QuantSig,PEP,MassErrorPPM
NVIVNSDTLGEK,ph,S,686,true,"Tissue atlas Arabidopsis - ProteomicsDB",114,32188942,"MaxQuant score",141.5800000,0.9783230,,,,4.1149201024382E-6,
LIQALVSGDSYR,ph,S,779,true,"Tissue atlas Arabidopsis - ProteomicsDB",114,32188942,"MaxQuant score",155.0200000,0.9320690,,,,1.1706200453432E-9,
LIQALVSGDSYR,ph,S,782,true,"Col-0 callus - FC Col-0 vs. Col-0 Xray",111a,31410901,,36.9500000,,-0.1550156,0.0000000,NO,,-2.5879154
LIQALVSGDSYR,ph,S,782,true,"Col-0 X-ray callus - FC Col-0 vs. Col-0 Xray",111b,31410901,,36.9500000,,-0.1550156,0.0000000,NO,,-2.5879154
LIQALVSGDSYR,ph,S,782,true,"atm callus - FC atm vs. atm Xray",111c,31410901,,36.9500000,,-0.7368792,0.0000000,NO,,-2.5879154
LIQALVSGDSYR,ph,S,782,true,"atm-3 X-ray callus - FC atm vs. atm Xray",111d,31410901,,36.9500000,,-0.7368792,0.0000000,NO,,-2.5879154
LIQALVSGDSYR,ph,S,782,true,"Tissue atlas Arabidopsis - ProteomicsDB",114,32188942,"MaxQuant score",180.8400000,0.9901720,,,,1.0795300237413E-19,
GVSGTSCSEGHGCSDLNTGLSSPGSR,ph,S,806,true,"Tissue atlas Arabidopsis - ProteomicsDB",114,32188942,"MaxQuant score",201.7300000,0.8667440,,,,0,
SSFGRPSP,ph,S,812,true,"Tissue atlas Arabidopsis - ProteomicsDB",114,32188942,"MaxQuant score",77.3580000,0.8324200,,,,0.0079837897792459,
SSFGRPSP,ph,S,817,true,"Tissue atlas Arabidopsis - ProteomicsDB",114,32188942,"MaxQuant score",77.3580000,1.0000000,,,,0.0079837897792459,
