Peptide,PTM,ModifiedAA,ModifiedPosition,PeptideUniqueToGene,ExperimentDesc,ExpID,PubmedID,ScoreType,IdentScore,LocProb,Log2FChange,PQ-val,QuantSig,PEP,MassErrorPPM
RHSYTVGSPATTSSNYSNTTFTDR,ph,S,8,true,"Tissue atlas Arabidopsis - ProteomicsDB",114,32188942,"MaxQuant score",146.5000000,0.9132210,,,,1.3032075718221E-43,
HSYTVGSPATTSSNYSNTTFTDR,ph,S,13,true,"Tissue atlas Arabidopsis - ProteomicsDB",114,32188942,"MaxQuant score",339.6700000,1.0000000,,,,0,
SFPTTPAR,ph,S,30,true,"atm and atr DNA damage response",88,25561503,"MASCOT Score",25.0000000,1.0000000,,,,,0.6500000
SFPTTPAR,ph,T,34,true,"atm and atr DNA damage response",88,25561503,"MASCOT Score",24.0000000,0.9950000,,,,,1.3100000
SFPTTPAR,ph,T,34,true,"Tissue atlas Arabidopsis - ProteomicsDB",114,32188942,"MaxQuant score",116.5200000,0.9965850,,,,0.0086891697719693,
TSTDTTTSIAR,ph,S,39,true,"atm and atr DNA damage response",88,25561503,"MASCOT Score",46.0000000,0.9950000,,,,,-0.0700000
SRRSSTGSSSVQR,ph,S,85,true,"atm and atr DNA damage response",88,25561503,"MASCOT Score",22.0000000,1.0000000,,,,,-1.4900000
SRRSSTGSSSVQR,ph,S,86,true,"atm and atr DNA damage response",88,25561503,"MASCOT Score",22.0000000,0.9920000,,,,,-1.4900000
RSSTGSSSVQR,ph,S,86,true,"atm and atr DNA damage response",88,25561503,"MASCOT Score",68.0000000,0.9960000,,,,,-0.5700000
NFSPSFR,ph,S,122,true,"Tissue atlas Arabidopsis - ProteomicsDB",114,32188942,"MaxQuant score",113.6200000,0.9999970,,,,0.010847300291061,
LAPDTDSGATHVSTQVK,ph,S,283,true,"atm and atr DNA damage response",88,25561503,"MASCOT Score",51.0000000,0.9430000,,,,,-0.0500000
LAPDTDSGATHVSTQVK,ph,S,283,true,"TOR Kinase and ABA Receptor",100,29290610,XCorr,4.2403765,0.8097000,,,,4.5060000957164E-6,
LAPDTDSGATHVSTQVK,ph,S,283,true,"Tissue atlas Arabidopsis - ProteomicsDB",114,32188942,"MaxQuant score",197.9400000,0.9993980,,,,1.7288701972408E-39,
LAPDTDSGATHVSTQVK,ph,T,284,true,"atm and atr DNA damage response",88,25561503,"MASCOT Score",38.0000000,1.0000000,,,,,-0.1200000
LAPDTDSGATHVSTQVK,ph,T,284,true,"Tissue atlas Arabidopsis - ProteomicsDB",114,32188942,"MaxQuant score",85.5630000,0.9993260,,,,0.00010499299969524,
