Peptide,PTM,ModifiedAA,ModifiedPosition,PeptideUniqueToGene,ExperimentDesc,ExpID,PubmedID,ScoreType,IdentScore,LocProb,Log2FChange,PQ-val,QuantSig,PEP,MassErrorPPM
SSSEESKPKDPVTVPSSK,ph,S,27,true,"Phospho cell culture sucrose/TOR",109,30833711,,,0.9928850,,,,,
SSSEESKPKDPVTVPSSK,ph,S,27,true,"Tissue atlas Arabidopsis - ProteomicsDB",114,32188942,"MaxQuant score",120.2500000,0.9995120,,,,4.8825499849789E-14,
SSSEESKPKDPVTVPSSK,ph,S,30,true,"Tissue atlas Arabidopsis - ProteomicsDB",114,32188942,"MaxQuant score",100.6200000,0.9999960,,,,5.9692700915548E-7,
TLKSPSAAVNSK,ph,S,46,true,"Tissue atlas Arabidopsis - ProteomicsDB",114,32188942,"MaxQuant score",199.8400000,0.9999180,,,,8.1773498928914E-25,
TLKSPSAAVNSK,ph,S,48,true,"Tissue atlas Arabidopsis - ProteomicsDB",114,32188942,"MaxQuant score",43.6570000,0.9244930,,,,0.014966200105846,
TDSSDDSEKQSFVLTR,ph,S,57,true,"Tissue atlas Arabidopsis - ProteomicsDB",114,32188942,"MaxQuant score",193.4200000,0.9880630,,,,2.2548900295634E-35,
TDSSDDSEKQSFVLTR,ph,S,58,true,"Tissue atlas Arabidopsis - ProteomicsDB",114,32188942,"MaxQuant score",193.4200000,0.9999940,,,,2.2548900295634E-35,
TDSSDDSEKQSFVLTR,ph,S,61,true,"Phospho cell culture sucrose/TOR",109,30833711,,,0.9740020,,,,,
TDSSDDSEKQSFVLTR,ph,S,61,true,"Tissue atlas Arabidopsis - ProteomicsDB",114,32188942,"MaxQuant score",193.4200000,0.9999990,,,,2.2548900295634E-35,
QSFVLTR,ph,S,65,false,"Tissue atlas Arabidopsis - ProteomicsDB",114,32188942,"MaxQuant score",76.5720000,1.0000000,,,,2.083180017376E-10,
KKEGAAESPAVK,ph,S,80,false,"Tissue atlas Arabidopsis - ProteomicsDB",114,32188942,"MaxQuant score",158.3000000,1.0000000,,,,2.2570400233235E-6,
KEGAAESPAVK,ph,S,80,false,"atm and atr DNA damage response",88,25561503,"MASCOT Score",49.0000000,1.0000000,,,,,-1.7200000
KEGAAESPAVK,ph,S,80,false,"TOR Kinase and ABA Receptor",100,29290610,XCorr,3.6396775,1.0000000,,,,0.013399999588728,
KEGAAESPAVK,ph,S,80,false,"Phospho cell culture sucrose/TOR",109,30833711,,,1.0000000,,,,,
EGAAESPAVK,ph,S,80,false,"atm and atr DNA damage response",88,25561503,"MASCOT Score",54.0000000,1.0000000,,,,,-1.3300000
EGAAESPAVK,ph,S,80,false,"Col-0 callus - FC Col-0 vs. Col-0 Xray",111a,31410901,,38.6900000,,0.8093201,0.0000000,NO,,-0.1338185
EGAAESPAVK,ph,S,80,false,"Col-0 X-ray callus - FC Col-0 vs. Col-0 Xray",111b,31410901,,38.6900000,,0.8093201,0.0000000,NO,,-0.1338185
EGAAESPAVK,ph,S,80,false,"atm callus - FC atm vs. atm Xray",111c,31410901,,38.6900000,,-0.1771344,0.0000000,NO,,-0.1338185
EGAAESPAVK,ph,S,80,false,"atm-3 X-ray callus - FC atm vs. atm Xray",111d,31410901,,38.6900000,,-0.1771344,0.0000000,NO,,-0.1338185
KDESILVK,ph,S,218,true,"Tissue atlas Arabidopsis - ProteomicsDB",114,32188942,"MaxQuant score",141.7100000,1.0000000,,,,0.0016648300224915,
