Peptide,PTM,ModifiedAA,ModifiedPosition,PeptideUniqueToGene,ExperimentDesc,ExpID,PubmedID,ScoreType,IdentScore,LocProb,Log2FChange,PQ-val,QuantSig,PEP,MassErrorPPM
GFEETVKSDSEGEVK,ph,S,44,true,"Tissue atlas Arabidopsis - ProteomicsDB",114,32188942,"MaxQuant score",233.3700000,0.9999970,,,,0,
GFEETVKSDSEGEVK,ph,S,46,true,"Tissue atlas Arabidopsis - ProteomicsDB",114,32188942,"MaxQuant score",162.8100000,1.0000000,,,,8.7488799841925E-13,
DLNSVYGSPK,ph,S,275,true,"Tissue atlas Arabidopsis - ProteomicsDB",114,32188942,"MaxQuant score",111.7900000,0.9998270,,,,0.00022001800243743,
SLPTENCCSR,ph,S,305,true,"Tissue atlas Arabidopsis - ProteomicsDB",114,32188942,"MaxQuant score",76.2330000,0.9998200,,,,0.0038810400292277,
EATPSDKEMLEK,ph,T,309,true,"Tissue atlas Arabidopsis - ProteomicsDB",114,32188942,"MaxQuant score",129.7400000,1.0000000,,,,2.3721100660623E-5,
EATPSDKEMLEK,ph,S,311,true,"Tissue atlas Arabidopsis - ProteomicsDB",114,32188942,"MaxQuant score",119.6200000,1.0000000,,,,0.0013370600063354,
EVSTPPQEAR,ph,T,382,true,"Tissue atlas Arabidopsis - ProteomicsDB",114,32188942,"MaxQuant score",134.9800000,0.9634260,,,,4.8609599616611E-5,
DASPTPDPGR,ph,S,435,true,"Tissue atlas Arabidopsis - ProteomicsDB",114,32188942,"MaxQuant score",104.0900000,0.9959540,,,,0.00033860999974422,
YVHERSPIR,ph,S,570,true,"TOR Kinase and ABA Receptor",100,29290610,XCorr,2.3586483,0.9999000,,,,0.0033070000354201,
YVHERSPIR,ph,S,570,true,"Tissue atlas Arabidopsis - ProteomicsDB",114,32188942,"MaxQuant score",102.9700000,0.9999910,,,,0.00024304700491484,
SENSSAHAIHNLKHSPENDLYCR,ph,S,621,true,"Tissue atlas Arabidopsis - ProteomicsDB",114,32188942,"MaxQuant score",179.8500000,1.0000000,,,,0,
IQDGWSSPSLSLR,ph,S,717,true,"Phosphorylation in N starvation",63,22060019,"MASCOT Score",36.0000000,,,,,,-6.8789700
IQDGWSSPSLSLR,ph,S,718,true,"Phosphorylation in N starvation",63,22060019,"MASCOT Score",36.0000000,,,,,,-6.8789700
IQDGWSSPSLSLR,ph,S,718,true,"Tissue atlas Arabidopsis - ProteomicsDB",114,32188942,"MaxQuant score",194.2000000,0.9957880,,,,2.112009947806E-30,
IQDGWSSPSLSLR,ph,S,720,true,"Phosphorylation in N starvation",63,22060019,"MASCOT Score",36.0000000,,,,,,-6.8789700
DFRTPEAYDSQNNHFHK,ph,T,746,true,"Tissue atlas Arabidopsis - ProteomicsDB",114,32188942,"MaxQuant score",133.1600000,1.0000000,,,,3.3300801005609E-10,
