Peptide,PTM,ModifiedAA,ModifiedPosition,PeptideUniqueToGene,ExperimentDesc,ExpID,PubmedID,ScoreType,IdentScore,LocProb,Log2FChange,PQ-val,QuantSig,PEP,MassErrorPPM
TKKKNPNVFL,nt,T,2,true,"Arabidopsis translation initiation landscape - NT",167b,35069635,,,,,,,,
ALCTGEAGVGK,ox,C,43,true,"OxiTRAQ Arabidopsis - 5 mM H2O2 versus control",47,24376095,,,,1.5831068,0.0038068,YES,,
KMELVGTSDGKPTSPVK,ph,S,165,true,"Tissue atlas Arabidopsis - ProteomicsDB",114,32188942,"MaxQuant score",179.9000000,0.8606380,,,,3.9363499732116E-26,
IIDCGETSQIR,ox,C,172,true,"OxiTRAQ Arabidopsis - 5 mM H2O2 versus control",47,24376095,,,,1.7306024,0.0013977,YES,,
IIDCGETSQIR,ph,S,176,true,"Tissue atlas Arabidopsis - ProteomicsDB",114,32188942,"MaxQuant score",120.2000000,0.8703680,,,,2.3616399630555E-5,
KSNKNFSPGDVSDR,ph,S,199,true,"STN8 phosphoproteome",38,21768351,"MASCOT Score",54.4200000,,,,,,
NFSPGDVSDREAK,ph,S,199,true,"Arabidopsis root NAA phosphoproteome",18a,27643528,"MaxQuant Score",80.3160000,1.0000000,,,,1.3129999842931E-6,0.2230000
NFSPGDVSDREAK,ph,S,199,true,"STN8 phosphoproteome",38,21768351,"MASCOT Score",43.8800000,,,,,,
NFSPGDVSDREAK,ph,S,199,true,"Phosphoproteome ethylene-regulated time response",46,24043427,"MASCOT Score",38.8400000,,,,,,10.4898000
NFSPGDVSDREAK,ph,S,199,true,"Tyrosine phosphorylation in Arabidopsis",59,18463617,"MASCOT Score",30.0000000,,,,,,-0.0666389
NFSPGDVSDREAK,ph,S,199,true,"srk2dei ABA signaling phopshoproteomics",83,23572148,"MASCOT Score",37.0000000,,,,,,-0.0008000
NFSPGDVSDREAK,ph,S,199,true,"LAXIC - mannitol vs control",84b,23660473,XCorr,2.7200000,1.0000000,2.3483926,,NO,0.014209000393748,
NFSPGDVSDREAK,ph,S,199,true,"SnRK2 protein kinase substrates",85,23776212,XCorr,3.1771686,1.0000000,,,,0.00075051101157442,
NFSPGDVSDREAK,ph,S,199,true,"atm and atr DNA damage response",88,25561503,"MASCOT Score",55.0000000,1.0000000,,,,,-0.6500000
NFSPGDVSDREAK,ph,S,199,true,"Brassinosteroid-Regulated Phosphorylation Dynamics",94,26187819,"MaxQuant Score",132.7900000,1.0000000,,,,2.9430000267894E-6,1.0180000
NFSPGDVSDREAK,ph,S,199,true,"TOR Kinase and ABA Receptor",100,29290610,XCorr,4.0928693,1.0000000,,,,0.00037920000613667,
NFSPGDVSDREAK,ph,S,199,true,"Phospho cell culture sucrose/TOR",109,30833711,,,1.0000000,,,,,
NFSPGDVSDREAK,ph,S,199,true,"Tissue atlas Arabidopsis - ProteomicsDB",114,32188942,"MaxQuant score",209.4200000,1.0000000,,,,3.1008198665288E-39,
NFSPGDVSDREAK,ph,S,199,true,"Touch-induced phosphorylation: 40s touch vs untouc",136,30291188,"MASCOT score",53.1600000,,-0.0847891,0.6346851,NO,,1.3082627
SNKNFSPGDVSDR,ph,S,199,true,"STN8 phosphoproteome",38,21768351,"MASCOT Score",51.7300000,,,,,,
SNKNFSPGDVSDR,ph,S,199,true,"Chloroplast kinase substrates",60,19376835,"MASCOT Score",36.9200000,,,,,,-0.3450250
NFSPGDVSDR,ph,S,199,true,"Phosphorylation RNA metabolism",22,16807317,,,,,,,,
NFSPGDVSDR,ph,S,199,true,"STN8 phosphoproteome",38,21768351,"MASCOT Score",47.2600000,,,,,,
NFSPGDVSDR,ph,S,199,true,"Tyrosine phosphorylation in Arabidopsis",59,18463617,"MASCOT Score",47.0000000,,,,,,-0.2558745
NFSPGDVSDR,ph,S,199,true,"Chloroplast kinase substrates",60,19376835,"MASCOT Score",33.0600000,,,,,,-0.4977420
NFSPGDVSDR,ph,S,199,true,"srk2dei ABA signaling phopshoproteomics",83,23572148,"MASCOT Score",35.0000000,,,,,,0.0002000
NFSPGDVSDR,ph,S,199,true,"LAXIC - ABA stress",84a,23660473,XCorr,2.5600000,1.0000000,,,,0.023245200514793,
NFSPGDVSDR,ph,S,199,true,"LAXIC - mannitol vs control",84b,23660473,XCorr,2.9600000,1.0000000,1.4953243,,NO,0.0076860599219799,
NFSPGDVSDR,ph,S,199,true,"SnRK2 protein kinase substrates",85,23776212,XCorr,2.2515249,1.0000000,,,,0.01633089967072,
NFSPGDVSDR,ph,S,199,true,"atm and atr DNA damage response",88,25561503,"MASCOT Score",44.0000000,1.0000000,,,,,0.1100000
NFSPGDVSDREAK,ph,S,204,true,"Arabidopsis root NAA phosphoproteome",18a,27643528,"MaxQuant Score",80.3160000,1.0000000,,,,1.3129999842931E-6,0.2230000
NFSPGDVSDREAK,ph,S,204,true,"STN8 phosphoproteome",38,21768351,"MASCOT Score",49.0100000,,,,,,-0.8687260
NFSPGDVSDREAK,ph,S,204,true,"Phosphoproteome ethylene-regulated time response",46,24043427,"MASCOT Score",49.4600000,,,,,,-4.5598000
NFSPGDVSDREAK,ph,S,204,true,"Tyrosine phosphorylation in Arabidopsis",59,18463617,"MASCOT Score",78.0000000,,,,,,-0.9329457
NFSPGDVSDREAK,ph,S,204,true,"srk2dei ABA signaling phopshoproteomics",83,23572148,"MASCOT Score",66.0000000,,,,,,-0.0013000
NFSPGDVSDREAK,ph,S,204,true,"LAXIC - mannitol vs control",84b,23660473,XCorr,2.7200000,1.0000000,2.3483926,,NO,0.014209000393748,
NFSPGDVSDREAK,ph,S,204,true,"SnRK2 protein kinase substrates",85,23776212,XCorr,3.1771686,1.0000000,,,,0.00075051101157442,
NFSPGDVSDREAK,ph,S,204,true,"atm and atr DNA damage response",88,25561503,"MASCOT Score",67.0000000,1.0000000,,,,,-0.7300000
NFSPGDVSDREAK,ph,S,204,true,"Brassinosteroid-Regulated Phosphorylation Dynamics",94,26187819,"MaxQuant Score",132.7900000,1.0000000,,,,2.9430000267894E-6,1.0180000
NFSPGDVSDREAK,ph,S,204,true,"TOR Kinase and ABA Receptor",100,29290610,XCorr,4.0928693,1.0000000,,,,0.00037920000613667,
NFSPGDVSDREAK,ph,S,204,true,"Tissue atlas Arabidopsis - ProteomicsDB",114,32188942,"MaxQuant score",209.4200000,1.0000000,,,,3.1008198665288E-39,
NFSPGDVSDREAK,ph,S,204,true,"Touch-induced phosphorylation: 40s touch vs untouc",136,30291188,"MASCOT score",53.1600000,,-0.0847891,0.6346851,NO,,1.3082627
SNKNFSPGDVSDR,ph,S,204,true,"STN8 phosphoproteome",38,21768351,"MASCOT Score",59.3500000,,,,,,-0.3041850
SNKNFSPGDVSDR,ph,S,204,true,"Chloroplast kinase substrates",60,19376835,"MASCOT Score",36.9200000,,,,,,-0.3450250
NFSPGDVSDR,ph,S,204,true,"STN8 phosphoproteome",38,21768351,"MASCOT Score",42.3500000,,,,,,-0.0471554
NFSPGDVSDR,ph,S,204,true,"Tyrosine phosphorylation in Arabidopsis",59,18463617,"MASCOT Score",56.0000000,,,,,,-1.1940824
NFSPGDVSDR,ph,S,204,true,"Chloroplast kinase substrates",60,19376835,"MASCOT Score",33.0600000,,,,,,-0.4977420
NFSPGDVSDR,ph,S,204,true,"srk2dei ABA signaling phopshoproteomics",83,23572148,"MASCOT Score",35.0000000,,,,,,0.0002000
NFSPGDVSDR,ph,S,204,true,"LAXIC - ABA stress",84a,23660473,XCorr,2.5600000,1.0000000,,,,0.023245200514793,
NFSPGDVSDR,ph,S,204,true,"LAXIC - mannitol vs control",84b,23660473,XCorr,2.9600000,1.0000000,1.4953243,,NO,0.0076860599219799,
NFSPGDVSDR,ph,S,204,true,"atm and atr DNA damage response",88,25561503,"MASCOT Score",55.0000000,1.0000000,,,,,0.0400000
VGHKAIKSVK,ac,K,318,true,"Histone deacetylases substrates - hda14 vs WT",98e,29061669,"MaxQuant Score",51.0000000,1.0000000,0.9110000,0.2280342,NO,0.028000000864267,
VGHKAIKSVK,ac,K,321,true,"Histone deacetylases substrates - hda14 vs WT",98e,29061669,"MaxQuant Score",51.0000000,1.0000000,0.9110000,0.2280342,NO,0.028000000864267,
VDNADQHANLDDSVKSR,ph,S,337,true,"Phospho cell culture sucrose/TOR",109,30833711,,,1.0000000,,,,,
VDNADQHANLDDSVKSR,ph,S,337,true,"Tissue atlas Arabidopsis - ProteomicsDB",114,32188942,"MaxQuant score",204.6300000,1.0000000,,,,4.2038953929745E-45,
VDNADQHANLDDSVK,ph,S,337,true,"TOR Kinase and ABA Receptor",100,29290610,XCorr,2.4387653,1.0000000,,,,0.0020900000818074,
SVKVDNADQHANLDDSVKSR,ph,S,340,true,"STN8 phosphoproteome",38,21768351,"MASCOT Score",46.7200000,,,,,,-0.7034520
SVKVDNADQHANLDDSVKSR,ph,S,340,true,"Chloroplast kinase substrates",60,19376835,"MASCOT Score",41.1700000,,,,,,3.1268500
VDNADQHANLDDSVKSR,ph,S,340,true,"STN8 phosphoproteome",38,21768351,"MASCOT Score",59.8000000,,,,,,-0.4369140
VDNADQHANLDDSVKSR,ph,S,340,true,"Chloroplast kinase substrates",60,19376835,"MASCOT Score",50.1000000,,,,,,-0.5284770
VDNADQHANLDDSVKSR,ph,S,340,true,"SnRK2 protein kinase substrates",85,23776212,XCorr,2.5355942,0.8810000,,,,0.019864700734615,
VDNADQHANLDDSVKSR,ph,S,340,true,"Tissue atlas Arabidopsis - ProteomicsDB",114,32188942,"MaxQuant score",286.2100000,1.0000000,,,,0,
VDNADQHANLDDSVKSR,ph,S,340,true,"Touch-induced phosphorylation: 40s touch vs untouc",136,30291188,"MASCOT score",71.7400000,,-0.1000426,0.3692262,NO,,4.9432819
VDNADQHANLDDSVKSRSR,ph,S,342,true,"Tissue atlas Arabidopsis - ProteomicsDB",114,32188942,"MaxQuant score",51.7660000,0.8965870,,,,0.0019079700578004,
VLGNGNRSPSRSPVR,ph,S,372,true,"Conserved plant phosphoproteome - Arabidopsis",61a,20466843,"MASCOT Score",21.0000000,1.0000000,,,,,
VLGNGNRSPSRSPVR,ph,S,372,true,"srk2dei ABA signaling phopshoproteomics",83,23572148,"MASCOT Score",25.0000000,,,,,,-0.0007000
VLGNGNRSPSRSPVR,ph,S,372,true,"TOR Kinase and ABA Receptor",100,29290610,XCorr,2.8104081,1.0000000,,,,0.00040680001256987,
VLGNGNRSPSRSPVR,ph,S,372,true,"Phospho cell culture sucrose/TOR",109,30833711,,,1.0000000,,,,,
VLGNGNRSPSRSPVR,ph,S,372,true,"Tissue atlas Arabidopsis - ProteomicsDB",114,32188942,"MaxQuant score",77.4690000,1.0000000,,,,0.00018860900308937,
VLGNGNRSPSRSPVR,ph,S,374,true,"Conserved plant phosphoproteome - Arabidopsis",61a,20466843,"MASCOT Score",21.0000000,1.0000000,,,,,
VLGNGNRSPSRSPVR,ph,S,374,true,"srk2dei ABA signaling phopshoproteomics",83,23572148,"MASCOT Score",25.0000000,,,,,,-0.0007000
VLGNGNRSPSRSPVR,ph,S,374,true,"TOR Kinase and ABA Receptor",100,29290610,XCorr,2.8104081,1.0000000,,,,0.00040680001256987,
VLGNGNRSPSRSPVR,ph,S,374,true,"Tissue atlas Arabidopsis - ProteomicsDB",114,32188942,"MaxQuant score",69.0810000,1.0000000,,,,0.00096486002439633,
VLGNGNRSPSRSPVR,ph,S,376,true,"Conserved plant phosphoproteome - Arabidopsis",61a,20466843,"MASCOT Score",21.0000000,1.0000000,,,,,
VLGNGNRSPSRSPVR,ph,S,376,true,"srk2dei ABA signaling phopshoproteomics",83,23572148,"MASCOT Score",25.0000000,,,,,,-0.0007000
VLGNGNRSPSRSPVR,ph,S,376,true,"TOR Kinase and ABA Receptor",100,29290610,XCorr,2.8104081,1.0000000,,,,0.00040680001256987,
VLGNGNRSPSRSPVR,ph,S,376,true,"Tissue atlas Arabidopsis - ProteomicsDB",114,32188942,"MaxQuant score",77.4690000,1.0000000,,,,0.00018860900308937,
DLGNGSRSPR,ph,S,385,true,"atm and atr DNA damage response",88,25561503,"MASCOT Score",24.0000000,1.0000000,,,,,-0.5400000
DLGNGSRSPR,ph,S,385,true,"Tissue atlas Arabidopsis - ProteomicsDB",114,32188942,"MaxQuant score",81.8030000,1.0000000,,,,0.0020033300388604,
DLGNGSRSPR,ph,S,387,true,"atm and atr DNA damage response",88,25561503,"MASCOT Score",32.0000000,1.0000000,,,,,-0.3700000
DLGNGSRSPR,ph,S,387,true,"Tissue atlas Arabidopsis - ProteomicsDB",114,32188942,"MaxQuant score",100.0700000,1.0000000,,,,0.00080000702291727,
EKPTEETVGKSFR,ph,S,400,true,"Tissue atlas Arabidopsis - ProteomicsDB",114,32188942,"MaxQuant score",48.6770000,0.9735150,,,,0.0086898598819971,
SFRSPSPSGVPK,ph,S,400,true,"srk2dei ABA signaling phopshoproteomics",83,23572148,"MASCOT Score",38.0000000,,,,,,0.0004000
SFRSPSPSGVPKR,ph,S,403,true,"Phosphoproteome ethylene-regulated time response",46,24043427,"MASCOT Score",32.5500000,,,,,,-18.1735000
SFRSPSPSGVPKR,ph,S,403,true,"Chloroplast kinase substrates",60,19376835,"MASCOT Score",39.1500000,,,,,,0.5481120
SFRSPSPSGVPKR,ph,S,403,true,"SnRK2 protein kinase substrates",85,23776212,XCorr,2.8416829,0.9120000,,,,0.0084996595978737,
SFRSPSPSGVPKR,ph,S,403,true,"atm and atr DNA damage response",88,25561503,"MASCOT Score",23.0000000,1.0000000,,,,,-1.0900000
SFRSPSPSGVPK,ph,S,403,true,"Arabidopsis root NAA phosphoproteome",18a,27643528,"MaxQuant Score",44.9980000,0.7810000,,,,0.016000000759959,0.4600000
SFRSPSPSGVPK,ph,S,403,true,"Phosphorylation RNA metabolism",22,16807317,,,,,,,,
SFRSPSPSGVPK,ph,S,403,true,"Phosphoproteome ethylene-regulated time response",46,24043427,"MASCOT Score",32.5900000,,,,,,16.5865000
SFRSPSPSGVPK,ph,S,403,true,"srk2dei ABA signaling phopshoproteomics",83,23572148,"MASCOT Score",38.0000000,,,,,,0.0006000
SFRSPSPSGVPK,ph,S,403,true,"LAXIC - ABA stress",84a,23660473,XCorr,3.6800000,0.9950000,,,,0.15862500667572,
SFRSPSPSGVPK,ph,S,403,true,"LAXIC - mannitol vs control",84b,23660473,XCorr,3.7000000,0.9980000,,,,0.00092624098761007,
SFRSPSPSGVPK,ph,S,403,true,"SnRK2 protein kinase substrates",85,23776212,XCorr,3.0396738,1.0000000,,,,5.9635399338731E-6,
SFRSPSPSGVPK,ph,S,403,true,"atm and atr DNA damage response",88,25561503,"MASCOT Score",28.0000000,0.9900000,,,,,-1.1500000
SFRSPSPSGVPK,ph,S,403,true,"TOR Kinase and ABA Receptor",100,29290610,XCorr,3.4499950,0.9083000,,,,0.0015360000543296,
SFRSPSPSGVPK,ph,S,403,true,"Col-0 callus - FC Col-0 vs. Col-0 Xray",111a,31410901,,28.7400000,,-0.0911638,0.0000000,NO,,0.9628039
SFRSPSPSGVPK,ph,S,403,true,"Col-0 X-ray callus - FC Col-0 vs. Col-0 Xray",111b,31410901,,28.7400000,,-0.0911638,0.0000000,NO,,0.9628039
SFRSPSPSGVPK,ph,S,403,true,"atm callus - FC atm vs. atm Xray",111c,31410901,,28.7400000,,-0.7162393,0.0000000,NO,,0.9628039
SFRSPSPSGVPK,ph,S,403,true,"atm-3 X-ray callus - FC atm vs. atm Xray",111d,31410901,,28.7400000,,-0.7162393,0.0000000,NO,,0.9628039
SFRSPSPSGVPK,ph,S,403,true,"Tissue atlas Arabidopsis - ProteomicsDB",114,32188942,"MaxQuant score",165.3600000,0.9999140,,,,4.9000300345048E-11,
SPSPSGVPK,ph,S,403,true,"atm and atr DNA damage response",88,25561503,"MASCOT Score",24.0000000,1.0000000,,,,,-1.1000000
SFRSPSPSGVPKR,ph,S,405,true,"Phosphoproteome ethylene-regulated time response",46,24043427,"MASCOT Score",32.5500000,,,,,,-18.1735000
SFRSPSPSGVPKR,ph,S,405,true,"Chloroplast kinase substrates",60,19376835,"MASCOT Score",39.1500000,,,,,,0.5481120
SFRSPSPSGVPKR,ph,S,405,true,"SnRK2 protein kinase substrates",85,23776212,XCorr,2.8416829,0.9430000,,,,0.0084996595978737,
SFRSPSPSGVPKR,ph,S,405,true,"atm and atr DNA damage response",88,25561503,"MASCOT Score",23.0000000,1.0000000,,,,,-1.0900000
SFRSPSPSGVPK,ph,S,405,true,"Arabidopsis root NAA phosphoproteome",18a,27643528,"MaxQuant Score",44.9980000,0.9710000,,,,0.016000000759959,0.4600000
SFRSPSPSGVPK,ph,S,405,true,"Phosphorylation RNA metabolism",22,16807317,,,,,,,,
SFRSPSPSGVPK,ph,S,405,true,"Phosphoproteome ethylene-regulated time response",46,24043427,"MASCOT Score",32.5900000,,,,,,16.5865000
SFRSPSPSGVPK,ph,S,405,true,"srk2dei ABA signaling phopshoproteomics",83,23572148,"MASCOT Score",38.0000000,,,,,,0.0004000
SFRSPSPSGVPK,ph,S,405,true,"LAXIC - ABA stress",84a,23660473,XCorr,3.6800000,0.9950000,,,,0.15862500667572,
SFRSPSPSGVPK,ph,S,405,true,"LAXIC - mannitol vs control",84b,23660473,XCorr,3.7000000,1.0000000,,,,0.00092624098761007,
SFRSPSPSGVPK,ph,S,405,true,"SnRK2 protein kinase substrates",85,23776212,XCorr,3.0396738,1.0000000,,,,5.9635399338731E-6,
SFRSPSPSGVPK,ph,S,405,true,"atm and atr DNA damage response",88,25561503,"MASCOT Score",28.0000000,0.9350000,,,,,-1.1500000
SFRSPSPSGVPK,ph,S,405,true,"TOR Kinase and ABA Receptor",100,29290610,XCorr,3.4499950,0.9884000,,,,0.0015360000543296,
SFRSPSPSGVPK,ph,S,405,true,"Col-0 callus - FC Col-0 vs. Col-0 Xray",111a,31410901,,28.7400000,,-0.0911638,0.0000000,NO,,0.9628039
SFRSPSPSGVPK,ph,S,405,true,"Col-0 X-ray callus - FC Col-0 vs. Col-0 Xray",111b,31410901,,28.7400000,,-0.0911638,0.0000000,NO,,0.9628039
SFRSPSPSGVPK,ph,S,405,true,"atm callus - FC atm vs. atm Xray",111c,31410901,,28.7400000,,-0.7162393,0.0000000,NO,,0.9628039
SFRSPSPSGVPK,ph,S,405,true,"atm-3 X-ray callus - FC atm vs. atm Xray",111d,31410901,,28.7400000,,-0.7162393,0.0000000,NO,,0.9628039
SPSPSGVPKR,ph,S,405,true,"Tissue atlas Arabidopsis - ProteomicsDB",114,32188942,"MaxQuant score",165.3600000,0.9999860,,,,4.9000300345048E-11,
SPSPSGVPK,ph,S,405,true,"atm and atr DNA damage response",88,25561503,"MASCOT Score",30.0000000,0.9970000,,,,,-1.3500000
SPSPSGVPK,ph,S,405,true,"TOR Kinase and ABA Receptor",100,29290610,XCorr,2.8113112,0.9088000,,,,0.012869999743998,
SPSPSGVPK,ph,S,405,true,"Lateral root-induction - NAA vs control",106,23328941,"MASCOT Score",30.0000000,,,,,,
SPSPSGVPK,ph,S,405,true,"Phospho cell culture sucrose/TOR",109,30833711,,,0.9998150,,,,,
SFRSPSPSGVPKR,ph,S,407,true,"Chloroplast kinase substrates",60,19376835,"MASCOT Score",38.5700000,,,,,,-0.5755310
SFRSPSPSGVPK,ph,S,407,true,"srk2dei ABA signaling phopshoproteomics",83,23572148,"MASCOT Score",29.0000000,,,,,,0.0004000
SFRSPSPSGVPK,ph,S,407,true,"Tissue atlas Arabidopsis - ProteomicsDB",114,32188942,"MaxQuant score",137.7500000,0.9205370,,,,1.2563699783641E-5,
GFTERYSFAR,ph,S,424,true,"Tissue atlas Arabidopsis - ProteomicsDB",114,32188942,"MaxQuant score",84.8920000,0.9999690,,,,0.00052426400361583,
YHTPSPERSPPR,ph,Y,429,true,"Conserved plant phosphoproteome - Arabidopsis",61a,20466843,"MASCOT Score",20.0000000,0.7978723,,,,,
KYHTPSPERSPPR,ph,T,431,true,"LAXIC - mannitol vs control",84b,23660473,XCorr,2.6200000,0.9960000,,,,0.00059196300571784,
KYHTPSPERSPPR,ph,T,431,true,"TOR Kinase and ABA Receptor",100,29290610,XCorr,3.4605412,0.9252000,,,,0.071560002863407,
KYHTPSPERSPPR,ph,T,431,true,"Phospho cell culture sucrose/TOR",109,30833711,,,0.9999970,,,,,
KYHTPSPERSPPR,ph,T,431,true,"Tissue atlas Arabidopsis - ProteomicsDB",114,32188942,"MaxQuant score",118.6600000,0.9998990,,,,9.4514201919083E-5,
YHTPSPERSPPR,ph,T,431,true,"Phosphorylation in N starvation",63,22060019,"MASCOT Score",20.0000000,,,,,,8.1616100
YHTPSPERSPPR,ph,T,431,true,"srk2dei ABA signaling phopshoproteomics",83,23572148,"MASCOT Score",22.0000000,,,,,,-0.0017000
YHTPSPERSPPR,ph,T,431,true,"TOR Kinase and ABA Receptor",100,29290610,XCorr,3.8811862,0.9893000,,,,0.0069039999507368,
KYHTPSPERSPPR,ph,S,433,true,"LAXIC - mannitol vs control",84b,23660473,XCorr,2.6200000,0.9990000,,,,0.00059196300571784,
KYHTPSPERSPPR,ph,S,433,true,"Tissue atlas Arabidopsis - ProteomicsDB",114,32188942,"MaxQuant score",118.6600000,0.9999910,,,,4.9286598368781E-5,
YHTPSPERSPPR,ph,S,433,true,"Conserved plant phosphoproteome - Arabidopsis",61a,20466843,"MASCOT Score",30.0000000,1.0000000,,,,,
YHTPSPERSPPR,ph,S,433,true,"srk2dei ABA signaling phopshoproteomics",83,23572148,"MASCOT Score",22.0000000,,,,,,-0.0017000
YHTPSPERSPPR,ph,S,433,true,"TOR Kinase and ABA Receptor",100,29290610,XCorr,3.8811862,1.0000000,,,,0.0069039999507368,
YHTPSPERSPPR,ph,S,433,true,"Phospho cell culture sucrose/TOR",109,30833711,,,1.0000000,,,,,
KYHTPSPERSPPR,ph,S,437,true,"LAXIC - mannitol vs control",84b,23660473,XCorr,2.6200000,0.9990000,,,,0.00059196300571784,
KYHTPSPERSPPR,ph,S,437,true,"TOR Kinase and ABA Receptor",100,29290610,XCorr,3.4605412,0.9252000,,,,0.071560002863407,
KYHTPSPERSPPR,ph,S,437,true,"Tissue atlas Arabidopsis - ProteomicsDB",114,32188942,"MaxQuant score",118.6600000,1.0000000,,,,4.9286598368781E-5,
YHTPSPERSPPR,ph,S,437,true,"Conserved plant phosphoproteome - Arabidopsis",61a,20466843,"MASCOT Score",30.0000000,1.0000000,,,,,
YHTPSPERSPPR,ph,S,437,true,"srk2dei ABA signaling phopshoproteomics",83,23572148,"MASCOT Score",22.0000000,,,,,,-0.0017000
YHTPSPERSPPR,ph,S,437,true,"TOR Kinase and ABA Receptor",100,29290610,XCorr,3.8811862,1.0000000,,,,0.0069039999507368,
SYSERSPR,ph,S,466,true,"Chloroplast kinase substrates",60,19376835,"MASCOT Score",32.2400000,,,,,,-0.7872220
SYSERSPR,ph,S,466,true,"atm and atr DNA damage response",88,25561503,"MASCOT Score",26.0000000,0.9860000,,,,,-0.1000000
SYSERSPR,ph,S,466,true,"Phospho cell culture sucrose/TOR",109,30833711,,,0.9907700,,,,,
SYSERSPR,ph,S,466,true,"Tissue atlas Arabidopsis - ProteomicsDB",114,32188942,"MaxQuant score",87.7890000,0.8577520,,,,0.013469399884343,
FRSPPR,ph,S,473,true,"srk2dei ABA signaling phopshoproteomics",83,23572148,"MASCOT Score",23.0000000,,,,,,-0.0002000
RQPISQDLK,ph,S,526,true,"Tissue atlas Arabidopsis - ProteomicsDB",114,32188942,"MaxQuant score",74.3060000,1.0000000,,,,0.011469800025225,
QPISQDLK,ph,S,526,true,"atm and atr DNA damage response",88,25561503,"MASCOT Score",26.0000000,1.0000000,,,,,-2.1400000
LGPQRSPIRGGR,ph,S,538,true,"Tissue atlas Arabidopsis - ProteomicsDB",114,32188942,"MaxQuant score",130.9900000,1.0000000,,,,3.0301900551422E-5,
LGPQRSPIR,ph,S,538,true,"Phosphoproteome ethylene-regulated time response",46,24043427,"MASCOT Score",30.7600000,,,,,,-14.1459000
LGPQRSPIR,ph,S,538,true,"Tyrosine phosphorylation in Arabidopsis",59,18463617,"MASCOT Score",34.0000000,,,,,,-0.4534883
LGPQRSPIR,ph,S,538,true,"srk2dei ABA signaling phopshoproteomics",83,23572148,"MASCOT Score",31.0000000,,,,,,0.0001000
LGPQRSPIR,ph,S,538,true,"Phospho cell culture sucrose/TOR",109,30833711,,,1.0000000,,,,,
GGRTSPAESLSPSHSPSPPGKR,ph,S,546,true,"Phospho cell culture sucrose/TOR",109,30833711,,,0.9997480,,,,,
TSPAESLSPSHSPSPPGK,ph,S,546,true,"atm and atr DNA damage response",88,25561503,"MASCOT Score",29.0000000,1.0000000,,,,,-0.3100000
TSPAESLSPSHSPSPPGKR,ph,S,550,true,"Tissue atlas Arabidopsis - ProteomicsDB",114,32188942,"MaxQuant score",95.3660000,0.9995810,,,,7.6800897659268E-6,
TSPAESLSPSHSPSPPGK,ph,S,550,true,"atm and atr DNA damage response",88,25561503,"MASCOT Score",29.0000000,1.0000000,,,,,-0.3100000
GGRTSPAESLSPSHSPSPPGKR,ph,S,552,true,"Phospho cell culture sucrose/TOR",109,30833711,,,0.9315010,,,,,
TSPAESLSPSHSPSPPGKR,ph,S,552,true,"Tissue atlas Arabidopsis - ProteomicsDB",114,32188942,"MaxQuant score",95.3660000,0.9854370,,,,7.6800897659268E-6,
TSPAESLSPSHSPSPPGK,ph,S,552,true,"atm and atr DNA damage response",88,25561503,"MASCOT Score",29.0000000,1.0000000,,,,,-0.3100000
TSPAESLSPSHSPSPPGK,ph,S,554,true,"Phospho cell culture sucrose/TOR",109,30833711,,,0.8000180,,,,,
GGRTSPAESLSPSHSPSPPGKR,ph,S,556,true,"Phospho cell culture sucrose/TOR",109,30833711,,,0.9857170,,,,,
TSPAESLSPSHSPSPPGKR,ph,S,556,true,"Tissue atlas Arabidopsis - ProteomicsDB",114,32188942,"MaxQuant score",95.3660000,0.8822870,,,,7.6800897659268E-6,
TSPAESLSPSHSPSPPGK,ph,S,556,true,"atm and atr DNA damage response",88,25561503,"MASCOT Score",29.0000000,1.0000000,,,,,-0.3100000
TSPAESLSPSHSPSPPGKR,ph,S,558,true,"Tissue atlas Arabidopsis - ProteomicsDB",114,32188942,"MaxQuant score",55.8810000,0.9724030,,,,0.00039351198938675,
