Peptide,PTM,ModifiedAA,ModifiedPosition,PeptideUniqueToGene,ExperimentDesc,ExpID,PubmedID,ScoreType,IdentScore,LocProb,Log2FChange,PQ-val,QuantSig,PEP,MassErrorPPM
FSEIVSGGGK,ph,S,136,true,"atm and atr DNA damage response",88,25561503,"MASCOT Score",38.0000000,0.9990000,,,,,-4.1000000
FSEIVSGGGK,ph,S,136,true,"Tissue atlas Arabidopsis - ProteomicsDB",114,32188942,"MaxQuant score",94.1910000,1.0000000,,,,0.00070236797910184,
STEQPPHVEGDAVK,ph,S,198,true,"Tissue atlas Arabidopsis - ProteomicsDB",114,32188942,"MaxQuant score",157.8400000,0.7837410,,,,1.9088500224917E-10,
STEQPPHVEGDAVKADAGHVVVEK,ac,K,211,true,"Histone deacetylases - hda14 vs WT (thylakoids)",98d,29061669,"MaxQuant Score",41.7000000,1.0000000,0.0830000,0.9862795,NO,0.0001170000032289,
AVPIPGSGLQLTNISHVR,ph,S,266,true,"srk2dei ABA signaling phopshoproteomics",83,23572148,"MASCOT Score",25.0000000,,,,,,-0.0057000
AVPIPGSGLQLTNISHVR,ph,T,271,true,"srk2dei ABA signaling phopshoproteomics",83,23572148,"MASCOT Score",25.0000000,,,,,,-0.0057000
AVPIPGSGLQLTNISHVR,ph,S,274,true,"srk2dei ABA signaling phopshoproteomics",83,23572148,"MASCOT Score",25.0000000,,,,,,-0.0057000
TVEIVHYDPKAIGVDAK,ac,K,331,true,"Histone deacetylases - apicidin vs control",98a,29061669,"MaxQuant Score",152.9000000,1.0000000,-0.0570000,0.7709035,NO,0,
TVEIVHYDPKAIGVDAK,ac,K,331,true,"Histone deacetylases substrates - TSA vs control",98b,29061669,"MaxQuant Score",152.9000000,1.0000000,0.1330000,0.9977001,NO,0,
TVEIVHYDPKAIGVDAK,ac,K,331,true,"Histone deacetylases- hda14 vs WT (low light)",98c,29061669,"MaxQuant Score",167.9200000,1.0000000,-0.0880000,0.9885531,NO,8.699999809213E-16,
TVEIVHYDPKAIGVDAK,ac,K,331,true,"Histone deacetylases substrates - hda14 vs WT",98e,29061669,"MaxQuant Score",139.5000000,1.0000000,0.1100000,0.9078205,NO,8.2676609395164E-44,
AIGVDAKK,ac,K,338,true,"Lysine acetylation gel-based Finkemeier et al",37,21311031,i-probability,0.8623350,,,,,,
AIGVDAKK,ac,K,338,true,"Histone deacetylases - apicidin vs control",98a,29061669,"MaxQuant Score",112.0000000,1.0000000,0.1060000,0.6714289,NO,0.0089999996125698,
AIGVDAKK,ac,K,338,true,"Histone deacetylases substrates - TSA vs control",98b,29061669,"MaxQuant Score",112.0000000,1.0000000,-0.2270000,0.9141132,NO,0.0089999996125698,
AIGVDAKK,ac,K,338,true,"Histone deacetylases- hda14 vs WT (low light)",98c,29061669,"MaxQuant Score",109.7100000,1.0000000,-0.2450000,0.9885531,NO,0.035999998450279,
AIGVDAKK,ac,K,338,true,"Histone deacetylases substrates - hda14 vs WT",98e,29061669,"MaxQuant Score",80.5000000,1.0000000,0.1280000,0.9120108,NO,0.020999999716878,
AIGVDAKK,ac,K,338,true,"Quantitative Acetylproteomics",101,29440448,,,,,,,,
NMHFYAEPR,nt,N,345,true,"N-terminal ChaFRADIC",92,26010716,"MASCOT Score",23.1900000,,,,,0.01630000025034,
TNLPEDLK,ph,T,365,true,"SIRK1 phosphorylation",86a,23820729,"MaxQuant Score",66.9810000,1.0000000,,,,0.65499997138977,5.8230000
TNLPEDLKER,ac,K,372,true,"Quantitative Acetylproteomics",101,29440448,,,,,,,,
FEEYVKIGR,ac,K,380,true,"Histone deacetylases substrates - hda14 vs WT",98e,29061669,"MaxQuant Score",71.5000000,1.0000000,-0.4280000,0.8912509,NO,0.003000000026077,
EIKFELDDK,ac,K,389,true,"Histone deacetylases - apicidin vs control",98a,29061669,"MaxQuant Score",107.3000000,1.0000000,0.2910000,0.2454709,NO,0.003000000026077,
EIKFELDDK,ac,K,389,true,"Histone deacetylases substrates - hda14 vs WT",98e,29061669,"MaxQuant Score",67.3000000,1.0000000,0.1680000,0.9099133,NO,0.0040000001899898,
EIKFELDDK,ac,K,389,true,"Quantitative Acetylproteomics",101,29440448,,,,,,,,
FELDDKILEALK,ac,K,395,true,"Histone deacetylases substrates - hda14 vs WT",98e,29061669,"MaxQuant Score",159.5000000,1.0000000,0.2580000,0.8689604,NO,1.9999999821952E-37,
