Peptide,PTM,ModifiedAA,ModifiedPosition,PeptideUniqueToGene,ExperimentDesc,ExpID,PubmedID,ScoreType,IdentScore,LocProb,Log2FChange,PQ-val,QuantSig,PEP,MassErrorPPM
VEYSDAVGEGCDGGHELNK,ph,S,324,true,"Tissue atlas Arabidopsis - ProteomicsDB",114,32188942,"MaxQuant score",133.9300000,0.9999970,,,,3.5158400052659E-15,
MSPSVACVQTVGDR,ph,S,501,true,"Large-scale phosphorylation discovery",44,23111157,XCorr,2.9580000,,,,,,
MSPSVACVQTVGDR,ph,S,501,true,"Tyrosine phosphorylation in Arabidopsis",59,18463617,"MASCOT Score",73.0000000,,,,,,-0.6306514
MSPSVACVQTVGDR,ph,S,501,true,"atm and atr DNA damage response",88,25561503,"MASCOT Score",63.0000000,0.9970000,,,,,-0.4200000
MSPSVACVQTVGDR,ph,S,501,true,"Phospho cell culture sucrose/TOR",109,30833711,,,0.9992940,,,,,
MSPSVACVQTVGDR,ph,S,501,true,"Tissue atlas Arabidopsis - ProteomicsDB",114,32188942,"MaxQuant score",262.4200000,0.9999970,,,,0,
HETPLNPDIVDSSANK,ph,T,587,true,"TOR Kinase and ABA Receptor",100,29290610,XCorr,5.2444611,1.0000000,,,,5.3710000003093E-8,
HETPLNPDIVDSSANKSPGLCSSLDMTTTVVPAQSPHQHK,ph,S,601,true,"Tissue atlas Arabidopsis - ProteomicsDB",114,32188942,"MaxQuant score",77.4980000,0.8504890,,,,1.6513399644623E-16,
HETPLNPDIVDSSANKSPGLCSSLDMTTTVVPAQSPHQHK,ph,S,619,true,"Tissue atlas Arabidopsis - ProteomicsDB",114,32188942,"MaxQuant score",77.4980000,0.9685340,,,,1.6513399644623E-16,
ENQGSPGKELDSDK,ph,S,695,true,"Tissue atlas Arabidopsis - ProteomicsDB",114,32188942,"MaxQuant score",286.7400000,1.0000000,,,,0,
LNSSPARGTPNCNSVCR,ph,S,779,true,"Tissue atlas Arabidopsis - ProteomicsDB",114,32188942,"MaxQuant score",142.7100000,0.9979380,,,,1.1356800069318E-14,
LNSSPARGTPNCNSVCR,ph,T,784,true,"Tissue atlas Arabidopsis - ProteomicsDB",114,32188942,"MaxQuant score",147.7600000,0.9999500,,,,3.6508599025596E-17,
EKLNSSPARGTPNCNSVCR,ph,S,789,true,"Tissue atlas Arabidopsis - ProteomicsDB",114,32188942,"MaxQuant score",69.8570000,0.9998820,,,,0.001205789973028,
ELDSLSNVPACLYSR,ph,S,984,true,"Tissue atlas Arabidopsis - ProteomicsDB",114,32188942,"MaxQuant score",84.2660000,0.9998850,,,,0.00018124800408259,
SLEEHVTPSITER,ph,S,1061,true,"atm and atr DNA damage response",88,25561503,"MASCOT Score",26.0000000,1.0000000,,,,,0.3700000
SLEEHVTPSITER,ph,S,1061,true,"Phospho cell culture sucrose/TOR",109,30833711,,,0.9991760,,,,,
SLEEHVTPSITER,ph,S,1061,true,"Col-0 callus - FC Col-0 vs. Col-0 Xray",111a,31410901,,28.5500000,,0.0808800,0.0000000,NO,,0.3546754
SLEEHVTPSITER,ph,S,1061,true,"Col-0 X-ray callus - FC Col-0 vs. Col-0 Xray",111b,31410901,,28.5500000,,0.0808800,0.0000000,NO,,0.3546754
SLEEHVTPSITER,ph,S,1061,true,"atm callus - FC atm vs. atm Xray",111c,31410901,,28.5500000,,1.5563779,0.0000000,NO,,0.3546754
SLEEHVTPSITER,ph,S,1061,true,"atm-3 X-ray callus - FC atm vs. atm Xray",111d,31410901,,28.5500000,,1.5563779,0.0000000,NO,,0.3546754
SLEEHVTPSITER,ph,S,1061,true,"Tissue atlas Arabidopsis - ProteomicsDB",114,32188942,"MaxQuant score",157.8200000,1.0000000,,,,5.6522098113021E-10,
SLEEHVTPSITER,ph,S,1061,true,"Touch-induced phosphorylation: 40s touch vs untouc",136,30291188,"MASCOT score",46.6700000,,-0.1628639,0.2177000,NO,,6.7122085
SLEEHVTPSITER,ph,T,1067,true,"Tissue atlas Arabidopsis - ProteomicsDB",114,32188942,"MaxQuant score",209.2100000,0.9989880,,,,1.1624600330265E-38,
SLEEHVTPSITER,ph,S,1069,true,"Tissue atlas Arabidopsis - ProteomicsDB",114,32188942,"MaxQuant score",176.4000000,0.7696300,,,,8.5806999831526E-16,
MNPPMHYGSPEPSYSSR,ph,Y,1176,true,"TOR Kinase and ABA Receptor",100,29290610,XCorr,2.8442094,0.8900000,,,,0.00023930000315886,
MNPPMHYGSPEPSYSSR,ph,S,1178,true,"atm and atr DNA damage response",88,25561503,"MASCOT Score",35.0000000,0.9930000,,,,,0.1600000
MNPPMHYGSPEPSYSSR,ph,S,1178,true,"Tissue atlas Arabidopsis - ProteomicsDB",114,32188942,"MaxQuant score",130.3700000,0.9999970,,,,1.9778199911169E-10,
