Peptide,PTM,ModifiedAA,ModifiedPosition,PeptideUniqueToGene,ExperimentDesc,ExpID,PubmedID,ScoreType,IdentScore,LocProb,Log2FChange,PQ-val,QuantSig,PEP,MassErrorPPM
FILLSPCPQR,acy,C,41,true,"Arabidopsis S-acylation atlas - Meristem",163a,35681017,,,,,,,,
SQGCDGNVAVEIK,acy,C,633,true,"Arabidopsis S-acylation atlas - Meristem",163a,35681017,,,,,,,,
GINLSGGQKQR,ac,K,769,false,"Quantitative Acetylproteomics",101,29440448,,,,,,,,
SISIESPR,ph,S,892,true,"atm and atr DNA damage response",88,25561503,"MASCOT Score",46.0000000,0.9960000,,,,,0.5200000
SISIESPR,ph,S,892,true,"Tissue atlas Arabidopsis - ProteomicsDB",114,32188942,"MaxQuant score",106.6600000,0.9961160,,,,2.9971099138493E-5,
SISIESPRQPK,ph,S,894,true,"STN8 phosphoproteome",38,21768351,"MASCOT Score",53.6100000,,,,,,-0.8364840
SISIESPRQPK,ph,S,894,true,"Chloroplast kinase substrates",60,19376835,"MASCOT Score",41.5500000,,,,,,-0.5491840
SISIESPRQPK,ph,S,894,true,"atm and atr DNA damage response",88,25561503,"MASCOT Score",37.0000000,0.9880000,,,,,-1.2800000
SISIESPRQPK,ph,S,894,true,"Tissue atlas Arabidopsis - ProteomicsDB",114,32188942,"MaxQuant score",188.4800000,0.9999990,,,,2.3971500393E-15,
SISIESPR,ph,S,894,true,"Arabidopsis root NAA phosphoproteome",18a,27643528,"MaxQuant Score",58.6990000,0.9940000,,,,0.00047810000251047,-0.6110000
SISIESPR,ph,S,894,true,"STN8 phosphoproteome",38,21768351,"MASCOT Score",49.6600000,,,,,,
SISIESPR,ph,S,894,true,"Tyrosine phosphorylation in Arabidopsis",59,18463617,"MASCOT Score",43.0000000,,,,,,-0.6201955
SISIESPR,ph,S,894,true,"Chloroplast kinase substrates",60,19376835,"MASCOT Score",44.2600000,,,,,,
SISIESPR,ph,S,894,true,"srk2dei ABA signaling phopshoproteomics",83,23572148,"MASCOT Score",45.0000000,,,,,,0.0007000
SISIESPR,ph,S,894,true,"atm and atr DNA damage response",88,25561503,"MASCOT Score",64.0000000,1.0000000,,,,,0.3000000
SISIESPR,ph,S,894,true,"TOR Kinase and ABA Receptor",100,29290610,XCorr,3.0918527,0.9930000,,,,0.0042389999143779,
SISIESPR,ph,S,894,true,"Phosphorylation tonoplast membrane fraction",107,18686298,"MASCOT Score",25.0000000,,,,,,
SISIESPRQPKSPK,ph,S,897,true,"Tissue atlas Arabidopsis - ProteomicsDB",114,32188942,"MaxQuant score",207.4700000,1.0000000,,,,2.4594399272471E-24,
SISIESPRQPK,ph,S,897,true,"Chloroplast kinase substrates",60,19376835,"MASCOT Score",37.8200000,,,,,,-0.5643050
SISIESPRQPK,ph,S,897,true,"atm and atr DNA damage response",88,25561503,"MASCOT Score",37.0000000,0.9880000,,,,,-1.2800000
SISIESPRQPK,ph,S,897,true,"TOR Kinase and ABA Receptor",100,29290610,XCorr,3.3990850,1.0000000,,,,0.023469999432564,
SISIESPR,ph,S,897,true,"STN8 phosphoproteome",38,21768351,"MASCOT Score",46.5500000,,,,,,-0.7200000
SISIESPR,ph,S,897,true,"Tyrosine phosphorylation in Arabidopsis",59,18463617,"MASCOT Score",25.0000000,,,,,,-0.7235614
SISIESPR,ph,S,897,true,"atm and atr DNA damage response",88,25561503,"MASCOT Score",47.0000000,1.0000000,,,,,-0.8000000
SISIESPRQPKSPK,ph,S,903,true,"Tissue atlas Arabidopsis - ProteomicsDB",114,32188942,"MaxQuant score",166.5300000,1.0000000,,,,2.3971500393E-15,
TTSMESPR,ph,S,911,true,"STN8 phosphoproteome",38,21768351,"MASCOT Score",40.2400000,,,,,,0.3594320
TTSMESPR,ph,S,911,true,"Chloroplast kinase substrates",60,19376835,"MASCOT Score",57.3300000,,,,,,-0.8736540
TTSMESPR,ph,S,911,true,"atm and atr DNA damage response",88,25561503,"MASCOT Score",33.0000000,0.9810000,,,,,-0.5700000
TTSMESPR,ph,S,911,true,"TOR Kinase and ABA Receptor",100,29290610,XCorr,2.6034622,0.9870000,,,,0.038710001856089,
TTSMESPR,ph,S,911,true,"Tissue atlas Arabidopsis - ProteomicsDB",114,32188942,"MaxQuant score",140.8800000,0.9999460,,,,0.002247940050438,
TTSMESPR,ph,S,914,true,"atm and atr DNA damage response",88,25561503,"MASCOT Score",40.0000000,1.0000000,,,,,-1.0200000
TTSMESPRLSELNDESIK,ph,S,922,true,"atm and atr DNA damage response",88,25561503,"MASCOT Score",21.0000000,0.9880000,,,,,-1.1000000
TTSMESPRLSELNDESIK,ph,S,922,true,"Tissue atlas Arabidopsis - ProteomicsDB",114,32188942,"MaxQuant score",93.4070000,0.9993090,,,,1.1943900062761E-5,
TTSMESPR,ph,S,922,true,"STN8 phosphoproteome",38,21768351,"MASCOT Score",40.2400000,,,,,,0.3594320
TTSMESPR,ph,S,922,true,"Chloroplast kinase substrates",60,19376835,"MASCOT Score",57.3300000,,,,,,-0.8736540
TTSMESPR,ph,S,922,true,"atm and atr DNA damage response",88,25561503,"MASCOT Score",33.0000000,0.9810000,,,,,-0.5700000
TTSMESPR,ph,S,922,true,"TOR Kinase and ABA Receptor",100,29290610,XCorr,2.6034622,0.9870000,,,,0.038710001856089,
TTSMESPR,ph,S,922,true,"Tissue atlas Arabidopsis - ProteomicsDB",114,32188942,"MaxQuant score",140.8800000,0.9999460,,,,0.002247940050438,
TTSMESPRLSELNDESIK,ph,S,925,true,"atm and atr DNA damage response",88,25561503,"MASCOT Score",21.0000000,1.0000000,,,,,-1.1000000
TTSMESPRLSELNDESIK,ph,S,925,true,"Tissue atlas Arabidopsis - ProteomicsDB",114,32188942,"MaxQuant score",93.4070000,0.9993580,,,,1.1943900062761E-5,
TTSMESPR,ph,S,925,true,"atm and atr DNA damage response",88,25561503,"MASCOT Score",40.0000000,1.0000000,,,,,-1.0200000
LSELNDESIK,ph,S,929,true,"srk2dei ABA signaling phopshoproteomics",83,23572148,"MASCOT Score",23.0000000,,,,,,0.0001000
LSELNDESIK,ph,S,929,true,"Tissue atlas Arabidopsis - ProteomicsDB",114,32188942,"MaxQuant score",59.8140000,0.9998940,,,,0.0011755200102925,
LSELNDESIK,ph,S,935,true,"Tissue atlas Arabidopsis - ProteomicsDB",114,32188942,"MaxQuant score",395.6600000,1.0000000,,,,0,
LSELNDESIKSFLGSNIPEDGSR,ph,S,938,true,"Tissue atlas Arabidopsis - ProteomicsDB",114,32188942,"MaxQuant score",399.3000000,0.9999890,,,,0,
LSELNDESIKSFLGSNIPEDGSR,ph,S,938,true,"Touch-induced phosphorylation: 40s touch vs untouc",136,30291188,"MASCOT score",82.6300000,,0.3784731,0.5570316,NO,,-2.3205458
SFLGSNIPEDGSRLIKEEER,ph,S,938,true,"srk2dei ABA signaling phopshoproteomics",83,23572148,"MASCOT Score",26.0000000,,,,,,0.0040000
SFLGSNIPEDGSR,ph,S,938,true,"TOR Kinase and ABA Receptor",100,29290610,XCorr,3.5026975,1.0000000,,,,6.8610002927016E-5,
SFLGSNIPEDGSRLIKEEER,ph,S,942,true,"srk2dei ABA signaling phopshoproteomics",83,23572148,"MASCOT Score",26.0000000,,,,,,0.0040000
SFLGSNIPEDGSR,ph,S,942,true,"Tissue atlas Arabidopsis - ProteomicsDB",114,32188942,"MaxQuant score",106.3000000,0.9999780,,,,0.00016242699348368,
YRPNTPLVLK,ph,T,1310,false,"Tissue atlas Arabidopsis - ProteomicsDB",114,32188942,"MaxQuant score",98.3370000,1.0000000,,,,0.00021791500330437,
EDFSDCTIISIAHR,ox,C,1483,true,"SPEAR - 10 mM H2O2 / mock",138a,34619326,,,,4.1212107,0.0097654,YES,,
EDFSDCTIISIAHR,ox,C,1483,true,"SPEAR - 50 mM H2O2 / mock",138b,34619326,,,,3.9173350,0.0087920,YES,,
