Peptide,PTM,ModifiedAA,ModifiedPosition,PeptideUniqueToGene,ExperimentDesc,ExpID,PubmedID,ScoreType,IdentScore,LocProb,Log2FChange,PQ-val,QuantSig,PEP,MassErrorPPM
GLSFGKLFSKLFAK,myr,G,2,true,"N-Terminal Myristoylated Proteins",102,29453228,,,,,,,,
FAKKEMR,nt,F,13,false,"Arabidopsis translation initiation landscape - NT",167b,35069635,,,,,,,,
TTILYKLK,ac,K,36,false,"Histone deacetylases - apicidin vs control",98a,29061669,"MaxQuant Score",141.5000000,1.0000000,0.0120000,0.9660509,NO,4.5000000682194E-5,
NISFTVWDVGGQDKIRPLWR,ub,K,73,false,"upl3 mutant / wildtype",168,35926874,"MaxQuant score",207.5600000,1.0000000,-0.1992554,0.7946200,NO,5.6051938572993E-45,0.2423700
GLIFVVDSNDR,nt,G,87,false,"Arg/N-end rule seed, prt6 vs. Wt",99,29168982,"MASCOT Score",37.0400000,,-0.7435216,0.0101661,NO,0.08839999884367,-1.8576654
QDLPNAMNAAEITDKLGLHSLR,ub,K,142,false,"Ubiquitination Membrane Proteins",120,33585938,,,,,,,,
QDLPNAMNAAEITDKLGLHSLR,ub,K,142,false,"upl3 mutant / wildtype",168,35926874,"MaxQuant score",147.2500000,1.0000000,2.1521834,0.0004600,YES,1.2600299717544E-24,1.2046000
QDLPNAMNAAEITDKLGLHSLR,ph,S,147,false,"Tissue atlas Arabidopsis - ProteomicsDB",114,32188942,"MaxQuant score",100.1500000,0.9957660,,,,3.924419816892E-12,
LGLHSLR,ph,S,147,false,"Tyrosine phosphorylation in Arabidopsis",59,18463617,"MASCOT Score",50.0000000,,,,,,-0.9148693
LGLHSLR,ph,S,147,false,"TOR Kinase and ABA Receptor",100,29290610,XCorr,2.7773836,1.0000000,,,,0.0052310000173748,
LGLHSLR,ph,S,147,false,"Lateral root-induction - NAA vs control",106,23328941,"MASCOT Score",32.0000000,,,,,,
