Peptide,PTM,ModifiedAA,ModifiedPosition,PeptideUniqueToGene,ExperimentDesc,ExpID,PubmedID,ScoreType,IdentScore,LocProb,Log2FChange,PQ-val,QuantSig,PEP,MassErrorPPM
MQIFVK,mox,M,1,false,"cat2 Methionine oxidation - 1h stress",62a,25693801,"MASCOT Score",36.0000000,,0.0320090,,NO,,
MQIFVK,mox,M,1,false,"cat2 Methionine oxidation - 3h stress",62b,25693801,"MASCOT Score",36.0000000,,0.0603850,,NO,,
MQIFVKTLTGK,ac,K,6,false,"Histone deacetylases - apicidin vs control",98a,29061669,"MaxQuant Score",52.5000000,1.0000000,0.1250000,0.5248075,NO,0.0089999996125698,
MQIFVKTLTGK,ac,K,6,false,"Quantitative Acetylproteomics",101,29440448,,,,,,,,
VKTLTGK,ac,K,6,false,"Quantitative Acetylproteomics",101,29440448,,,,,,,,
MQIFVKTLTGK,ub,K,6,false,"TAP 6xHis-tag Ub",1,19292762,XCorr,3.8400000,,,,,,
MQIFVKTLTGK,ub,K,6,false,"Ubiquitination Membrane Proteins",120,33585938,,,,,,,,
MQIFVKTLTGK,ub,K,6,false,"upl3 mutant / wildtype",168,35926874,"MaxQuant score",144.2700000,1.0000000,-0.2584252,0.7437600,NO,4.4164298884652E-9,2.4383000
KTITLEVESS,nt,K,11,false,"Arabidopsis translation initiation landscape - NT",167b,35069635,,,,,,,,
TLTGKTITLEVESSDTIDNVKAK,ub,K,11,false,"Ubiquitination Membrane Proteins",120,33585938,,,,,,,,
TLTGKTITLEVESSDTIDNVK,ub,K,11,false,"TAP 6xHis-tag Ub",1,19292762,XCorr,4.5800000,,,,,,
TLTGKTITLEVESSDTIDNVK,ub,K,11,false,"MudPIT plant ubiquitination",103,17272265,XCorr,6.8700000,,,,,,
TLTGKTITLEVESSDTIDNVK,ub,K,11,false,"Ubiquitination Membrane Proteins",120,33585938,,,,,,,,
TLTGKTITLEVESSDTIDNVK,ub,K,11,false,"upl3 mutant / wildtype",168,35926874,"MaxQuant score",269.9000000,1.0000000,0.6443178,0.6861200,NO,0,-0.0984030
TITLEVESSDTIDNVKAK,hib,K,27,false,"Open search Plant PTM Viewer 2.0 - hib",164e,TBA,,,,,,,,
TITLEVESSDTIDNVKAK,ub,K,27,false,"Ubiquitination Membrane Proteins",120,33585938,,,,,,,,
TITLEVESSDTIDNVKAK,ub,K,27,false,"upl3 mutant / wildtype",168,35926874,"MaxQuant score",154.4600000,1.0000000,0.0412430,,,1.3006400543676E-19,-2.2282000
AKIQDKEGIPPDQQR,ub,K,29,false,"TAP 6xHis-tag Ub",1,19292762,XCorr,5.1800000,,,,,,
AKIQDKEGIPPDQQR,ub,K,29,false,"MudPIT plant ubiquitination",103,17272265,XCorr,4.8500000,,,,,,
AKIQDKEGIPPDQQR,ub,K,29,false,"Ubiquitination Membrane Proteins",120,33585938,,,,,,,,
AKIQDKEGIPPDQQR,ub,K,29,false,"upl3 mutant / wildtype",168,35926874,"MaxQuant score",191.3700000,1.0000000,-0.9050884,0.0873230,NO,3.1904601087609E-26,0.8811800
IQDKEGIPPDQQR,cr,K,33,false,"Open search Plant PTM Viewer 2.0 - Crotonylation",164c,TBA,,,,,,,,
AKIQDKEGIPPDQQR,ub,K,33,false,"TAP 6xHis-tag Ub",1,19292762,XCorr,5.1800000,,,,,,
AKIQDKEGIPPDQQR,ub,K,33,false,"Ubiquitination Membrane Proteins",120,33585938,,,,,,,,
AKIQDKEGIPPDQQR,ub,K,33,false,"upl3 mutant / wildtype",168,35926874,"MaxQuant score",191.3700000,1.0000000,-0.9050884,0.0873230,NO,3.1904601087609E-26,0.8811800
IQDKEGIPPDQQR,ub,K,33,false,"TAP 6xHis-tag Ub",1,19292762,XCorr,2.5500000,,,,,,
IQDKEGIPPDQQR,ub,K,33,false,"MudPIT plant ubiquitination",103,17272265,XCorr,3.5000000,,,,,,
IQDKEGIPPDQQR,ub,K,33,false,"upl3 mutant / wildtype",168,35926874,"MaxQuant score",161.2100000,1.0000000,0.1557492,0.6283600,NO,3.8044298478679E-15,0.4472800
LIFAGKQLEDGR,nt,L,43,false,"Arabidopsis translation initiation landscape - NT",167b,35069635,,,,,,,,
LIFAGKQLEDGR,ac,K,48,false,"Histone deacetylases - apicidin vs control",98a,29061669,"MaxQuant Score",76.1000000,1.0000000,-0.2060000,0.2404363,NO,0.00063000002410263,
LIFAGKQLEDGR,ac,K,48,false,"Quantitative Acetylproteomics",101,29440448,,,,,,,,
LIFAGKQLEDGR,cr,K,48,false,"Open search Plant PTM Viewer 2.0 - Crotonylation",164c,TBA,,,,,,,,
LIFAGKQLEDGR,me2,K,48,false,"Arabidopsis protein methylome",123,31809900,"MaxQuant Score",158.5800000,1.0000000,,,,2.8025969286496E-45,0.3884500
LIFAGKQLEDGRTLADYNIQK,ub,K,48,false,"TAP 6xHis-tag Ub",1,19292762,XCorr,4.9900000,,,,,,
LIFAGKQLEDGRTLADYNIQK,ub,K,48,false,"Ubiquitination Membrane Proteins",120,33585938,,,,,,,,
LIFAGKQLEDGRTLADYNIQK,ub,K,48,false,"upl3 mutant / wildtype",168,35926874,"MaxQuant score",146.1600000,1.0000000,-0.2653446,0.4625600,NO,6.3510802172928E-10,1.5675000
LIFAGKQLEDGR,ub,K,48,false,"TAP 6xHis-tag Ub",1,19292762,XCorr,4.3200000,,,,,,
LIFAGKQLEDGR,ub,K,48,false,"Arabidopsis ubiquitination COFRADIC",40,26744219,"MaxQuant Score",166.0400000,1.0000000,,,,0,-0.6820000
LIFAGKQLEDGR,ub,K,48,false,"MudPIT plant ubiquitination",103,17272265,XCorr,4.6000000,,,,,,
LIFAGKQLEDGR,ub,K,48,false,"Ubiquitination Membrane Proteins",120,33585938,,,,,,,,
LIFAGKQLEDGR,ub,K,48,false,"upl3 mutant / wildtype",168,35926874,"MaxQuant score",146.1600000,1.0000000,-0.2653446,0.4625600,NO,6.3510802172928E-10,-1.3821000
QLEDGRTLADYNIQKESTLHLVLR,ub,K,63,false,"Ubiquitination Membrane Proteins",120,33585938,,,,,,,,
TLADYNIQKESTLHLVLR,ub,K,63,false,"TAP 6xHis-tag Ub",1,19292762,XCorr,2.8400000,,,,,,
TLADYNIQKESTLHLVLR,ub,K,63,false,"MudPIT plant ubiquitination",103,17272265,XCorr,5.3000000,,,,,,
TLADYNIQKESTLHLVLR,ub,K,63,false,"Ubiquitination Membrane Proteins",120,33585938,,,,,,,,
TLADYNIQKESTLHLVLR,ub,K,63,false,"upl3 mutant / wildtype",168,35926874,"MaxQuant score",366.9900000,1.0000000,-0.2042331,0.6076800,NO,0,-0.1877200
ESTLHLVLR,ph,S,65,false,"atm and atr DNA damage response",88,25561503,"MASCOT Score",27.0000000,0.9970000,,,,,1.4600000
ESTLHLVLR,ph,T,66,false,"Tissue atlas Arabidopsis - ProteomicsDB",114,32188942,"MaxQuant score",130.5300000,0.9963610,,,,0.00032401300268248,
AKKRKKKTY,nt,A,77,false,"Arabidopsis translation initiation landscape - NT",167b,35069635,,,,,,,,
VKLAVLQFYK,ub,K,99,false,"upl3 mutant / wildtype",168,35926874,"MaxQuant score",79.9860000,1.0000000,,,,0.00099085702095181,2.4752000
LAVLQFYKIDGSGKVQR,ub,K,113,true,"Ubiquitination Membrane Proteins",120,33585938,,,,,,,,
IDGSGKVQR,ub,K,113,true,"Ubiquitination Membrane Proteins",120,33585938,,,,,,,,
IDGSGKVQR,ub,K,113,true,"upl3 mutant / wildtype",168,35926874,"MaxQuant score",130.6600000,1.0000000,-0.0588937,0.9468800,NO,0.0006578000029549,-0.2254600
KECPNATCGAGTFMASHFDR,ub,K,119,false,"upl3 mutant / wildtype",168,35926874,"MaxQuant score",51.5660000,1.0000000,0.2809563,,,0.00071910000406206,-0.3353700
ECPNATCGAGTFMASHFDR,so,C,121,false,"S-sulfenylation site detection using YAP1C",110,32714340,,,,,,,,
DRHYCGKCGLTYVYQKEGVEA,nt,D,137,true,"Arabidopsis translation initiation landscape - NT",167b,35069635,,,,,,,,
CGLTYVYQK,acy,C,144,false,"Arabidopsis S-acylation atlas - Leaf",163c,35681017,,,,,,,,
CGLTYVYQK,so,C,144,false,"S-sulfenylation site detection using YAP1C",110,32714340,,,,,,,,
