Peptide,PTM,ModifiedAA,ModifiedPosition,PeptideUniqueToGene,ExperimentDesc,ExpID,PubmedID,ScoreType,IdentScore,LocProb,Log2FChange,PQ-val,QuantSig,PEP,MassErrorPPM
IKSVEQLK,ph,S,134,true,"Tissue atlas Arabidopsis - ProteomicsDB",114,32188942,"MaxQuant score",105.1300000,1.0000000,,,,0.0079249497503042,
SAALQIPTSFR,ph,T,299,true,"TOR Kinase and ABA Receptor",100,29290610,XCorr,2.1516840,0.9917000,,,,0.0034509999677539,
SAALQIPTSFR,ph,T,299,true,"Tissue atlas Arabidopsis - ProteomicsDB",114,32188942,"MaxQuant score",160.5200000,0.8642760,,,,3.0375299497898E-10,
SAALQIPTSFR,ph,S,300,true,"Tissue atlas Arabidopsis - ProteomicsDB",114,32188942,"MaxQuant score",154.0900000,0.7501650,,,,4.6812498322168E-10,
YLQAVGSFGGGGSR,ph,S,397,true,"Arabidopsis root NAA phosphoproteome",18a,27643528,"MaxQuant Score",73.2790000,0.9880000,,,,1.9140000517837E-7,-0.3250000
YLQAVGSFGGGGSR,ph,S,397,true,"STN8 phosphoproteome",38,21768351,"MASCOT Score",79.2500000,,,,,,-0.6183730
YLQAVGSFGGGGSR,ph,S,397,true,"Pollen phosphoproteome Arabidopsis",43,22631563,"MASCOT Score",66.2500000,,,,,,-2.0940300
YLQAVGSFGGGGSR,ph,S,397,true,"Chloroplast kinase substrates",60,19376835,"MASCOT Score",84.9300000,,,,,,-2.4142300
YLQAVGSFGGGGSR,ph,S,397,true,"srk2dei ABA signaling phopshoproteomics",83,23572148,"MASCOT Score",97.0000000,,,,,,-0.0004000
YLQAVGSFGGGGSR,ph,S,397,true,"SnRK2 protein kinase substrates",85,23776212,XCorr,3.1091802,1.0000000,,,,0.00032469499274157,
YLQAVGSFGGGGSR,ph,S,397,true,"atm and atr DNA damage response",88,25561503,"MASCOT Score",68.0000000,1.0000000,,,,,-0.1500000
YLQAVGSFGGGGSR,ph,S,397,true,"Brassinosteroid-Regulated Phosphorylation Dynamics",94,26187819,"MaxQuant Score",101.4900000,0.9990000,,,,0.0080000003799796,0.8420000
YLQAVGSFGGGGSR,ph,S,397,true,"Protein sumoylation and phosphorylation cross-talk",97,28419593,,,,,,,,
YLQAVGSFGGGGSR,ph,S,397,true,"TOR Kinase and ABA Receptor",100,29290610,XCorr,3.7870896,0.9998000,,,,3.7419999898702E-6,
YLQAVGSFGGGGSR,ph,S,397,true,"Phospho cell culture sucrose/TOR",109,30833711,,,0.9991590,,,,,
YLQAVGSFGGGGSR,ph,S,397,true,"Col-0 callus - FC Col-0 vs. Col-0 Xray",111a,31410901,,45.6500000,,0.5709997,0.0000000,NO,,0.5997688
YLQAVGSFGGGGSR,ph,S,397,true,"Col-0 X-ray callus - FC Col-0 vs. Col-0 Xray",111b,31410901,,45.6500000,,0.5709997,0.0000000,NO,,0.5997688
YLQAVGSFGGGGSR,ph,S,397,true,"atm callus - FC atm vs. atm Xray",111c,31410901,,45.6500000,,-0.9915001,0.0000000,NO,,0.5997688
YLQAVGSFGGGGSR,ph,S,397,true,"atm-3 X-ray callus - FC atm vs. atm Xray",111d,31410901,,45.6500000,,-0.9915001,0.0000000,NO,,0.5997688
YLQAVGSFGGGGSR,ph,S,397,true,"Tissue atlas Arabidopsis - ProteomicsDB",114,32188942,"MaxQuant score",160.8000000,0.9996420,,,,1.2107199964806E-10,
YLQAVGSFGGGGSR,ph,S,403,true,"Brassinosteroid-Regulated Phosphorylation Dynamics",94,26187819,"MaxQuant Score",92.9770000,0.9840000,,,,0.0089999996125698,-3.9820000
TSTASAIASPSQGWPVINR,ph,S,450,true,"Tissue atlas Arabidopsis - ProteomicsDB",114,32188942,"MaxQuant score",232.3700000,0.9995120,,,,0,
TPVQASSSSVQSR,ph,S,489,true,"Tissue atlas Arabidopsis - ProteomicsDB",114,32188942,"MaxQuant score",130.2700000,0.9261960,,,,6.6320098994765E-5,
TPVQASSSSVQSR,ph,S,490,true,"Tissue atlas Arabidopsis - ProteomicsDB",114,32188942,"MaxQuant score",127.3200000,0.7608270,,,,6.5696898673195E-5,
TPVQASSSSVQSR,ph,S,491,true,"Tissue atlas Arabidopsis - ProteomicsDB",114,32188942,"MaxQuant score",269.8700000,0.9773040,,,,0,
PLASAVPQAAR,ph,S,509,true,"Tissue atlas Arabidopsis - ProteomicsDB",114,32188942,"MaxQuant score",69.0300000,1.0000000,,,,0.00083138700574636,
NANRIPHSSSAPNLSDTR,ph,S,524,true,"srk2dei ABA signaling phopshoproteomics",83,23572148,"MASCOT Score",48.0000000,,,,,,0.0001000
IPHSSSAPNLSDTR,ph,S,524,true,"Large-scale phosphorylation discovery",44,23111157,XCorr,2.8490000,,,,,,
IPHSSSAPNLSDTR,ph,S,524,true,"Lateral root-induction - NAA vs control",106,23328941,"MASCOT Score",34.0000000,,,,,,
NANRIPHSSSAPNLSDTR,ph,S,525,true,"srk2dei ABA signaling phopshoproteomics",83,23572148,"MASCOT Score",48.0000000,,,,,,-0.0007000
IPHSSSAPNLSDTR,ph,S,525,true,"Large-scale phosphorylation discovery",44,23111157,XCorr,3.6070000,,,,,,
IPHSSSAPNLSDTR,ph,S,525,true,"srk2dei ABA signaling phopshoproteomics",83,23572148,"MASCOT Score",29.0000000,,,,,,-0.0004000
IPHSSSAPNLSDTR,ph,S,525,true,"SnRK2 protein kinase substrates",85,23776212,XCorr,2.4953325,0.9140000,,,,9.8399395938031E-6,
NANRIPHSSSAPNLSDTR,ph,S,526,true,"Phosphoproteome ethylene-regulated time response",46,24043427,"MASCOT Score",82.7500000,,,,,,-9.8095000
NANRIPHSSSAPNLSDTR,ph,S,526,true,"PAMP-triggered phosphorylation",48,24601666,"MASCOT Score",30.7500000,,,,,,
NANRIPHSSSAPNLSDTR,ph,S,526,true,"srk2dei ABA signaling phopshoproteomics",83,23572148,"MASCOT Score",55.0000000,,,,,,-0.0006000
NANRIPHSSSAPNLSDTR,ph,S,526,true,"Brassinosteroid-Regulated Phosphorylation Dynamics",94,26187819,"MaxQuant Score",97.3840000,0.9800000,,,,0.0070000002160668,1.0820000
NANRIPHSSSAPNLSDTR,ph,S,526,true,"Protein sumoylation and phosphorylation cross-talk",97,28419593,,,,,,,,
IPHSSSAPNLSDTR,ph,S,526,true,"Large-scale phosphorylation discovery",44,23111157,XCorr,3.6730000,,,,,,
IPHSSSAPNLSDTR,ph,S,526,true,"srk2dei ABA signaling phopshoproteomics",83,23572148,"MASCOT Score",42.0000000,,,,,,0.0000000
IPHSSSAPNLSDTR,ph,S,526,true,"atm and atr DNA damage response",88,25561503,"MASCOT Score",33.0000000,0.8760000,,,,,-0.0600000
IPHSSSAPNLSDTR,ph,S,526,true,"Lateral root-induction - NAA vs control",106,23328941,"MASCOT Score",33.0000000,,,,,,
IPHSSSAPNLSDTR,ph,S,526,true,"Phospho cell culture sucrose/TOR",109,30833711,,,0.9787530,,,,,
IPHSSSAPNLSDTR,ph,S,526,true,"Tissue atlas Arabidopsis - ProteomicsDB",114,32188942,"MaxQuant score",253.4600000,0.9998990,,,,0,
SALGHDEDVFVAFR,ph,S,586,true,"Tissue atlas Arabidopsis - ProteomicsDB",114,32188942,"MaxQuant score",169.1900000,1.0000000,,,,9.8266698014084E-20,
LQSSQNPQEEEEEAISK,ph,S,707,true,"Tissue atlas Arabidopsis - ProteomicsDB",114,32188942,"MaxQuant score",136.3900000,0.9522190,,,,3.8603900631706E-10,
GKSQVVGTDSSSTGSK,ph,S,733,true,"Tissue atlas Arabidopsis - ProteomicsDB",114,32188942,"MaxQuant score",105.9900000,1.0000000,,,,2.1173800632823E-6,
LGDGSMAALLDLNNSTR,ph,S,764,true,"Tissue atlas Arabidopsis - ProteomicsDB",114,32188942,"MaxQuant score",93.2260000,1.0000000,,,,1.1120800081699E-5,
