Peptide,PTM,ModifiedAA,ModifiedPosition,PeptideUniqueToGene,ExperimentDesc,ExpID,PubmedID,ScoreType,IdentScore,LocProb,Log2FChange,PQ-val,QuantSig,PEP,MassErrorPPM
MDSVIESEEGLKVDSPNRADAETSNSK,ph,S,15,true,"Phosphorylation Early Elicitor Signaling",23,17317660,,,,,,,,
MDSVIESEEGLKVDSPNR,ph,S,15,true,"Tissue atlas Arabidopsis - ProteomicsDB",114,32188942,"MaxQuant score",312.6500000,1.0000000,,,,0,
VDSPNRADAETSNSK,ph,S,15,true,"Phytohormone-responsive phosphoproteins",34,20374526,"MASCOT Score",40.0000000,,,,,,5.3984400
VDSPNRADAETSNSK,ph,S,15,true,"atm and atr DNA damage response",88,25561503,"MASCOT Score",39.0000000,1.0000000,,,,,0.5100000
VDSPNRADAETSNSK,ph,S,15,true,"TOR Kinase and ABA Receptor",100,29290610,XCorr,4.3246760,1.0000000,,,,2.721999953792E-5,
TVASFTGEKQAISNYNK,ub,K,282,false,"Ubiquitination Membrane Proteins",120,33585938,,,,,,,,
STVVSLIER,ph,T,446,false,"Lateral root-induction - NAA vs control",106,23328941,"MASCOT Score",21.0000000,,,,,,
FIDKLPQGLDTMVGEHGTQLSGGQK,ub,K,526,false,"upl3 mutant / wildtype",168,35926874,"MaxQuant score",58.8120000,1.0000000,,,,3.2454399843118E-6,-0.8027900
TTVVVAHRLSTVR,ph,S,601,false,"Tissue atlas Arabidopsis - ProteomicsDB",114,32188942,"MaxQuant score",124.9100000,0.8735930,,,,1.7076899894164E-5,
QTEDSTDEQKLSMESMKR,ph,S,657,true,"Plasmamembrane phosphorylation",20,15308754,,,,,,,,
QTEDSTDEQKLSMESMKR,ph,S,657,true,"Tissue atlas Arabidopsis - ProteomicsDB",114,32188942,"MaxQuant score",129.8500000,0.9818960,,,,1.5909799519487E-14,
QTEDSTDEQKLSMESMKR,ph,S,660,true,"Plasmamembrane phosphorylation",20,15308754,,,,,,,,
QTEDSTDEQKLSMESMKR,ph,S,660,true,"Tissue atlas Arabidopsis - ProteomicsDB",114,32188942,"MaxQuant score",43.2930000,0.9817190,,,,0.0068494901061058,
SSSFSMFGFPAGIDTNNEAIPEKDIK,ph,S,681,true,"Tissue atlas Arabidopsis - ProteomicsDB",114,32188942,"MaxQuant score",99.5150000,0.9223210,,,,9.606490114711E-22,
VSTPIKEK,ph,T,707,true,"atm and atr DNA damage response",88,25561503,"MASCOT Score",21.0000000,0.9960000,,,,,-2.9400000
SMCFEK,sno,C,809,false,"hot5-4 / wildtype, FAT-switch S-nitrosoproteome",169,37277371,,,,,,,,
TVASFCAEEK,sno,C,928,false,"hot5-4 / wildtype, FAT-switch S-nitrosoproteome",169,37277371,,,,,,,,
VLDNVKGDIELR,ub,K,1049,false,"Ubiquitination Membrane Proteins",120,33585938,,,,,,,,
GVQLSGGQKQR,ac,K,1197,false,"Quantitative Acetylproteomics",101,29440448,,,,,,,,
LSTIKNADVIAVVK,ub,K,1254,false,"Ubiquitination Membrane Proteins",120,33585938,,,,,,,,
