Peptide,PTM,ModifiedAA,ModifiedPosition,PeptideUniqueToGene,ExperimentDesc,ExpID,PubmedID,ScoreType,IdentScore,LocProb,Log2FChange,PQ-val,QuantSig,PEP,MassErrorPPM
VKSMAAEEEEVIEPQAKVTN,nt,V,76,true,"HUNTER N-terminome: legumain, GluC and trypsin",119,31951383,"MaxQuant score",61.7030000,,,,,,
SMAAEEEEVIEPQAKVTN,nt,S,78,true,"HUNTER N-terminome: legumain, GluC and trypsin",119,31951383,"MaxQuant score",91.7430000,,,,,,
AAEEEEVIEPQAKVTNKVYFDVEIGGEVAGR,nt,A,80,true,"Stromal N-terminome",96,26371235,"MASCOT Score",49.1500000,,,,,,
AAEEEEVIEPQAKVTNKVYFDVEIGGEVAGR,nt,A,80,true,"HUNTER N-terminome: legumain, GluC and trypsin",119,31951383,"MaxQuant score",199.6400000,,,,,,
AAEEEEVIEPQAKVTNKVYF,nt,A,80,true,"Arabidopsis translation initiation landscape - NT",167b,35069635,,,,,,,,
AAEEEEVIEPQAKVTN,nt,A,80,true,"HUNTER N-terminome: legumain, GluC and trypsin",119,31951383,"MaxQuant score",276.1200000,,,,,,
AAEEEEVIEPQAKVT,nt,A,80,true,"N-terminal ChaFRADIC",92,26010716,"MASCOT Score",36.4300000,,,,,6.7769998501888E-9,
AAEEEEVIEPQ,nt,A,80,true,"N-terminal ChaFRADIC",92,26010716,"MASCOT Score",99.4500000,,,,,8.9229998390117E-11,
AAEEEEVIEPQAKVTN,nta,A,80,true,"HUNTER N-terminome: legumain, GluC and trypsin",119,31951383,"MaxQuant score",52.9280000,,,,,,
AAEEEEVIEPQAK,nta,A,80,true,"Characterization plant N-terminal acetylation",6,22223895,"MASCOT Score",54.2300000,,,,,,
AAEEEEVIEPQ,nta,A,80,true,"N-terminal ChaFRADIC",92,26010716,"MASCOT Score",47.8000000,,,,,0.0068310000933707,
AEEEEVIEPQAKVTN,nt,A,81,true,"HUNTER N-terminome: legumain, GluC and trypsin",119,31951383,"MaxQuant score",112.5100000,,,,,,
AEEEEVIEPQ,nt,A,81,true,"N-terminal ChaFRADIC",92,26010716,"MASCOT Score",78.9500000,,,,,7.8370000267114E-8,
IVMGLFGEVVPKTVENFR,nt,I,111,true,"Stromal N-terminome",96,26371235,"MASCOT Score",56.2500000,,,,,,
IVMGLFGEVVPKTVENFR,ac,K,122,true,"Histone deacetylases- hda14 vs WT (low light)",98c,29061669,"MaxQuant Score",95.6600000,1.0000000,0.0440000,0.9931160,NO,1.1000000085915E-5,
ALCTGEK,ox,C,131,false,"OxiTRAQ Arabidopsis - 5 mM H2O2 versus control",47,24376095,,,,-0.1553836,0.4914629,NO,,
ALCTGEK,sno,C,131,false,"hot5-4 / wildtype, FAT-switch S-nitrosoproteome",169,37277371,,,,,,,,
ALCTGEK,so,C,131,false,"Arabidopsis S-sulfenylation chemoproteomics",108,31578252,"pFind PSM Score",0.0736608,,0.9177400,,,,-0.0130946
ALCTGEK,so,C,131,false,"S-sulfenylation site detection using YAP1C",110,32714340,,,,,,,,
ALCTGEKK,ac,K,135,true,"Histone deacetylases- hda14 vs WT (low light)",98c,29061669,"MaxQuant Score",130.7500000,1.0000000,1.1050000,0.9885531,NO,0.016000000759959,
YGYKGSSFHR,ac,K,140,true,"Histone deacetylases substrates - TSA vs control",98b,29061669,"MaxQuant Score",167.1000000,1.0000000,-0.0020000,0.9977001,NO,1.3000000080865E-6,
YGYKGSSFHR,ac,K,140,true,"Histone deacetylases- hda14 vs WT (low light)",98c,29061669,"MaxQuant Score",94.6600000,1.0000000,-0.0530000,0.9931160,NO,0.00025000001187436,
YGYKGSSFHR,ac,K,140,true,"Quantitative Acetylproteomics",101,29440448,,,,,,,,
IQGGDFTE,nt,I,153,true,"Arg/N-end rule seed, prt6 vs. Wt",99,29168982,"MASCOT Score",48.4900000,,-0.1206718,0.7296337,NO,0.0042679999023676,-0.0783335
FEDENFTLK,ph,T,180,true,"Tissue atlas Arabidopsis - ProteomicsDB",114,32188942,"MaxQuant score",108.9800000,1.0000000,,,,0.0015146499499679,
SMANAGPNTNGSQFF,nt,S,190,false,"Arabidopsis translation initiation landscape - NT",167b,35069635,,,,,,,,
TSWLDNKHVVFGQVIEGMK,ac,K,216,true,"Histone deacetylases- hda14 vs WT (low light)",98c,29061669,"MaxQuant Score",214.5500000,1.0000000,0.2360000,0.9885531,NO,5.2999999556584E-25,
HVVFGQVIEGMK,mox,M,227,true,"cat2 Methionine oxidation - 1h stress",62a,25693801,"MASCOT Score",84.0000000,,-0.3566791,,NO,,
HVVFGQVIEGMK,mox,M,227,true,"cat2 Methionine oxidation - 3h stress",62b,25693801,"MASCOT Score",68.0000000,,-0.2043105,,NO,,
HVVFGQVIEGMKLVR,ac,K,228,true,"Histone deacetylases substrates - hda14 vs WT",98e,29061669,"MaxQuant Score",92.0000000,1.0000000,0.7960000,0.9162205,NO,1.7000000018808E-10,
HVVFGQVIEGMKLVR,ac,K,228,true,"Quantitative Acetylproteomics",101,29440448,,,,,,,,
HVVFGQVIEGMK,ac,K,228,true,"Quantitative Acetylproteomics",101,29440448,,,,,,,,
TLESQETR,nt,T,232,true,"Arg/N-end rule seed, prt6 vs. Wt",99,29168982,"MASCOT Score",42.5300000,,-0.1310909,0.3798202,NO,0.060750000178814,-0.9218010
AFDVPKK,ac,K,245,true,"Quantitative Acetylproteomics",101,29440448,,,,,,,,
IYACGELPLDA,sno,C,253,true,"hot5-4 / wildtype, FAT-switch S-nitrosoproteome",169,37277371,,,,0.2810333,0.0136846,NO,,
