Peptide,PTM,ModifiedAA,ModifiedPosition,PeptideUniqueToGene,ExperimentDesc,ExpID,PubmedID,ScoreType,IdentScore,LocProb,Log2FChange,PQ-val,QuantSig,PEP,MassErrorPPM
AEEQKIALES,nt,A,2,true,"N-term acetylation drought responses",5,26184543,,,,,,,,
AEEQKIALE,nt,A,2,true,"N-terminal ChaFRADIC",92,26010716,"MASCOT Score",41.8600000,,,,,0.013000000268221,
AEEQKIALESESPAKVTTPAPA,nta,A,2,true,"Arabidopsis translation initiation landscape - NTA",167a,35069635,,,,,,,,
AEEQKIALES,nta,A,2,true,"N-term acetylation drought responses",5,26184543,,,,,,,,
AEEQKIALE,nta,A,2,true,"N-terminal ChaFRADIC",92,26010716,"MASCOT Score",41.8600000,,,,,0.013000000268221,
AEEQKIALESESPAK,ub,K,6,true,"upl3 mutant / wildtype",168,35926874,"MaxQuant score",134.1400000,1.0000000,-0.3492354,0.7615200,NO,1.7325200302176E-11,0.8828800
IALESESPAKVTTPAPADTPAPAPAEIPAPAPAPTPADVTK,ph,S,11,true,"Phosphorylation Early Elicitor Signaling",23,17317660,,,,,,,,
IALESESPAK,ph,S,11,true,"Sucrose-induced phosphorylation",24,17586839,,,,,,,,
IALESESPAK,ph,S,11,true,"Tyrosine phosphorylation in Arabidopsis",59,18463617,"MASCOT Score",54.0000000,,,,,,-0.8900636
IALESESPAK,ph,S,11,true,"srk2dei ABA signaling phopshoproteomics",83,23572148,"MASCOT Score",35.0000000,,,,,,0.0010000
IALESESPAK,ph,S,11,true,"Lateral root-induction - NAA vs control",106,23328941,"MASCOT Score",33.0000000,,,,,,
IALESESPAK,ph,S,11,true,"Tissue atlas Arabidopsis - ProteomicsDB",114,32188942,"MaxQuant score",82.1710000,0.8595200,,,,8.8857399305198E-7,
AEEQKIALESESPAK,ph,S,13,true,"Protein sumoylation and phosphorylation cross-talk",97,28419593,,,,,,,,
IALESESPAK,ph,S,13,true,"Plasmamembrane phosphorylation",20,15308754,,,,,,,,
IALESESPAK,ph,S,13,true,"Plasmembrane Ph Immune Responses",25,17651370,,,,,,,,
IALESESPAK,ph,S,13,true,"Phytohormone-responsive phosphoproteins",34,20374526,"MASCOT Score",53.0000000,,,,,,9.5720300
IALESESPAK,ph,S,13,true,"STN8 phosphoproteome",38,21768351,"MASCOT Score",67.5300000,,,,,,-0.1122870
IALESESPAK,ph,S,13,true,"Tyrosine phosphorylation in Arabidopsis",59,18463617,"MASCOT Score",62.0000000,,,,,,-0.5340380
IALESESPAK,ph,S,13,true,"Chloroplast kinase substrates",60,19376835,"MASCOT Score",67.4800000,,,,,,0.0476376
IALESESPAK,ph,S,13,true,"srk2dei ABA signaling phopshoproteomics",83,23572148,"MASCOT Score",62.0000000,,,,,,0.0001000
IALESESPAK,ph,S,13,true,"LAXIC - ABA stress",84a,23660473,XCorr,2.8200000,1.0000000,,,,0.0093069300055504,
IALESESPAK,ph,S,13,true,"LAXIC - mannitol vs control",84b,23660473,XCorr,2.1100000,0.9940000,,,,0.091110602021217,
IALESESPAK,ph,S,13,true,"SnRK2 protein kinase substrates",85,23776212,XCorr,2.6486340,0.9970000,,,,0.047164600342512,
IALESESPAK,ph,S,13,true,"SIRK1 phosphorylation",86a,23820729,"MaxQuant Score",188.5000000,0.9880000,,,,5.7199998991564E-5,7.1210000
IALESESPAK,ph,S,13,true,"atm and atr DNA damage response",88,25561503,"MASCOT Score",53.0000000,1.0000000,,,,,1.1400000
IALESESPAK,ph,S,13,true,"TOR Kinase and ABA Receptor",100,29290610,XCorr,4.0608673,0.9998000,,,,0.00061400001868606,
IALESESPAK,ph,S,13,true,"Lateral root-induction - NAA vs control",106,23328941,"MASCOT Score",37.0000000,,,,,,
IALESESPAK,ph,S,13,true,"Phosphorylation tonoplast membrane fraction",107,18686298,"MASCOT Score",56.0000000,,,,,,
IALESESPAK,ph,S,13,true,"Col-0 callus - FC Col-0 vs. Col-0 Xray",111a,31410901,,43.3600000,,-1.0506469,0.0000000,NO,,-0.0158961
IALESESPAK,ph,S,13,true,"Col-0 X-ray callus - FC Col-0 vs. Col-0 Xray",111b,31410901,,43.3600000,,-1.0506469,0.0000000,NO,,-0.0158961
IALESESPAK,ph,S,13,true,"atm callus - FC atm vs. atm Xray",111c,31410901,,43.3600000,,-1.9605737,0.0000000,NO,,-0.0158961
IALESESPAK,ph,S,13,true,"atm-3 X-ray callus - FC atm vs. atm Xray",111d,31410901,,43.3600000,,-1.9605737,0.0000000,NO,,-0.0158961
IALESESPAK,ph,S,13,true,"Tissue atlas Arabidopsis - ProteomicsDB",114,32188942,"MaxQuant score",215.0400000,1.0000000,,,,7.4714996189465E-27,
IALESESPAK,ph,S,13,true,"Touch-induced phosphorylation: 40s touch vs untouc",136,30291188,"MASCOT score",53.5800000,,-0.0582865,0.4142781,NO,,7.8142948
VTTPAPADTPAPAPAEIPAPAPAPTPADVTKDVAEEK,ub,K,47,true,"upl3 mutant / wildtype",168,35926874,"MaxQuant score",111.5000000,1.0000000,0.2289726,0.7963000,NO,6.5264602079709E-23,0.7789700
DVAEEKIQNPPPEQIFDDSK,ub,K,53,true,"upl3 mutant / wildtype",168,35926874,"MaxQuant score",92.9320000,1.0000000,,,,1.0081699741704E-7,-0.8047300
IQNPPPEQIFDDSKALTVVEKPVEEPAPAKPASASLDR,ub,K,67,true,"upl3 mutant / wildtype",168,35926874,"MaxQuant score",72.8780000,1.0000000,-0.5084034,0.5301000,NO,7.4572399511442E-15,0.4252800
ALTVVEKPVEEPAPAKPASASLDR,ph,T,70,true,"Tissue atlas Arabidopsis - ProteomicsDB",114,32188942,"MaxQuant score",157.1600000,1.0000000,,,,0,
ALTVVEKPVEEPAPAKPASASLDR,ub,K,74,true,"upl3 mutant / wildtype",168,35926874,"MaxQuant score",172.4200000,1.0000000,-1.6850135,,,9.12236959747E-37,0.8438700
ALTVVEKPVEEPAPAKPASASLDR,ub,K,83,true,"upl3 mutant / wildtype",168,35926874,"MaxQuant score",148.0900000,1.0000000,-1.2075611,,,8.7453798647505E-31,-0.0843510
ALTVVEKPVEEPAPAKPASASLDR,ph,S,86,true,"Phosphorylation Early Elicitor Signaling",23,17317660,,,,,,,,
ALTVVEKPVEEPAPAKPASASLDR,ph,S,86,true,"Tissue atlas Arabidopsis - ProteomicsDB",114,32188942,"MaxQuant score",214.1500000,0.9626050,,,,0,
ALTVVEKPVEEPAPAKPASASLDR,ph,S,88,true,"Large-scale phosphorylation discovery",44,23111157,XCorr,4.6080000,,,,,,
ALTVVEKPVEEPAPAKPASASLDR,ph,S,88,true,"Tissue atlas Arabidopsis - ProteomicsDB",114,32188942,"MaxQuant score",139.5900000,0.7583380,,,,3.6705999226157E-35,
DVKLADLSKEKR,nt,D,92,true,"Metacaspase9 substrates - Col-0 / mc9",51a,23964026,"MASCOT Score",66.0000000,,2.3808220,,NO,,-1.1196085
DVKLADLSKEKR,nt,D,92,true,"Metacaspase9 substrates - 35S:MC9 / mc9",51b,23964026,"MASCOT Score",78.0000000,,2.2491463,,NO,,-1.5320952
DVKLADLSKEKR,ub,K,94,true,"Arabidopsis ubiquitination COFRADIC",40,26744219,"MaxQuant Score",112.0800000,1.0000000,,,,7.5489997586331E-10,0.6750000
LADLSKEKR,ph,S,99,true,"Tissue atlas Arabidopsis - ProteomicsDB",114,32188942,"MaxQuant score",152.0400000,1.0000000,,,,0.0002093280054396,
LADLSKEK,ph,S,99,true,"atm and atr DNA damage response",88,25561503,"MASCOT Score",31.0000000,1.0000000,,,,,-3.1800000
DVKLADLSKEKR,ub,K,100,true,"Arabidopsis ubiquitination COFRADIC",40,26744219,"MaxQuant Score",112.0800000,1.0000000,,,,7.5489997586331E-10,0.6750000
DVKLADLSKEKR,ub,K,102,true,"Arabidopsis ubiquitination COFRADIC",40,26744219,"MaxQuant Score",112.0800000,1.0000000,,,,7.5489997586331E-10,0.6750000
RLSFVR,ph,S,105,true,"Tyrosine phosphorylation in Arabidopsis",59,18463617,"MASCOT Score",43.0000000,,,,,,-0.1167635
RLSFVR,ph,S,105,true,"Chloroplast kinase substrates",60,19376835,"MASCOT Score",39.1400000,,,,,,-0.5234830
RLSFVR,ph,S,105,true,"srk2dei ABA signaling phopshoproteomics",83,23572148,"MASCOT Score",47.0000000,,,,,,0.0001000
RLSFVR,ph,S,105,true,"SIRK1 phosphorylation",86a,23820729,"MaxQuant Score",109.1300000,1.0000000,,,,0.24600000679493,7.3470000
RLSFVR,ph,S,105,true,"SIRK1 exp - sirk1 mutant vs WT",86b,23820729,,,,-1.4983887,,NO,,
RLSFVR,ph,S,105,true,"SIRK1 exp - 35S:SIRK1 vs WT",86c,23820729,,,,1.2307786,,NO,,
LSFVR,ph,S,105,false,"Sucrose-induced phosphorylation",24,17586839,,,,,,,,
AWEESEKSK,ac,K,115,false,"Quantitative Acetylproteomics",101,29440448,,,,,,,,
AWEESEKSK,ub,K,115,false,"upl3 mutant / wildtype",168,35926874,"MaxQuant score",71.6140000,1.0000000,0.3606452,0.3099200,NO,0.016015900298953,-1.0791000
KAAVEAQLK,me2,K,137,true,"Arabidopsis protein methylome",123,31809900,"MaxQuant Score",89.0470000,1.0000000,,,,0.0025140200741589,0.4724600
KAAVEAQLK,ub,K,137,true,"Ubiquitination Membrane Proteins",120,33585938,,,,,,,,
KAAVEAQLKK,ac,K,145,true,"Quantitative Acetylproteomics",101,29440448,,,,,,,,
AAVEAQLKK,me2,K,145,true,"Arabidopsis protein methylome",123,31809900,"MaxQuant Score",96.1430000,1.0000000,,,,0.0021829099860042,1.4006000
KAAVEAQLKK,ub,K,145,true,"Ubiquitination Membrane Proteins",120,33585938,,,,,,,,
AAVEAQLKK,ub,K,145,true,"Ubiquitination Membrane Proteins",120,33585938,,,,,,,,
AAVEAQLKK,ub,K,145,true,"upl3 mutant / wildtype",168,35926874,"MaxQuant score",85.6700000,1.0000000,,,,0.020766599103808,0.6768900
KIEEQLEKK,ac,K,153,true,"Quantitative Acetylproteomics",101,29440448,,,,,,,,
RAMIEAKR,ac,K,183,false,"Quantitative Acetylproteomics",101,29440448,,,,,,,,
AMIEAKR,me1,K,183,false,"Arabidopsis protein methylome",123,31809900,"MaxQuant Score",41.6520000,1.0000000,,,,0.01668700017035,-0.3852400
AMIEAKR,ub,K,183,false,"Arabidopsis ubiquitination COFRADIC",40,26744219,"MaxQuant Score",81.2970000,1.0000000,,,,0.0080000003799796,-0.6670000
GEDVLKAEETAAKYR,ub,K,190,true,"Arabidopsis ubiquitination COFRADIC",40,26744219,"MaxQuant Score",92.8000000,1.0000000,,,,7.6060002740519E-9,-2.0540000
RGEDVLKAEETAAKYR,ac,K,197,true,"Quantitative Acetylproteomics",101,29440448,,,,,,,,
AEETAAKYR,ac,K,197,true,"Quantitative Acetylproteomics",101,29440448,,,,,,,,
GEDVLKAEETAAKYR,ub,K,197,true,"Arabidopsis ubiquitination COFRADIC",40,26744219,"MaxQuant Score",63.2900000,1.0000000,,,,3.0399999104702E-6,1.7470000
ATGIVPKATCGCF,ub,K,206,true,"upl3 mutant / wildtype",168,35926874,"MaxQuant score",64.1210000,1.0000000,-0.1568201,0.3567800,NO,0.0029160499107093,-1.1504000
ATGIVPKATCGCF,acy,C,209,true,"Arabidopsis S-acylation atlas - Seedling",163d,35681017,,,,,,,,
ATGIVPKATCGCF,acy,C,209,true,"Arabidopsis S-acylation atlas - Silique",163e,35681017,,,,,,,,
ATGIVPKATCGCF,acy,C,211,true,"Arabidopsis S-acylation atlas - Seedling",163d,35681017,,,,,,,,
ATGIVPKATCGCF,acy,C,211,true,"Arabidopsis S-acylation atlas - Silique",163e,35681017,,,,,,,,
