Peptide,PTM,ModifiedAA,ModifiedPosition,PeptideUniqueToGene,ExperimentDesc,ExpID,PubmedID,ScoreType,IdentScore,LocProb,Log2FChange,PQ-val,QuantSig,PEP,MassErrorPPM
YPPGVGTGRGAPPNPDYHQSYR,me1,R,16,true,"Arabidopsis protein methylome",123,31809900,"MaxQuant Score",61.3450000,1.0000000,,,,9.7182601166423E-5,0.7113300
YPPGVGTGRGAPPNPDYHQSYR,me2,R,16,true,"Arabidopsis protein methylome",123,31809900,"MaxQuant Score",87.2080000,1.0000000,,,,1.447069981203E-11,0.5197400
GYSQNPQQMQLQQQHQQQQQQQQWSR,ph,S,45,true,"Tissue atlas Arabidopsis - ProteomicsDB",114,32188942,"MaxQuant score",252.2100000,1.0000000,,,,0,
RPQLPGNASNANEVVQQTTQPEASSDANGQDWK,ng,N,75,true,"N-linked Glycan Micro-heterogeneity Arabidopsis",134,29237727,,,,,,,,
RPQLPGNASNANEVVQQTTQPEASSDANGQDWK,ph,S,77,true,"Tissue atlas Arabidopsis - ProteomicsDB",114,32188942,"MaxQuant score",206.1400000,1.0000000,,,,0,
YQTADVTATKGNEFEDYFLK,ub,K,122,true,"upl3 mutant / wildtype",168,35926874,"MaxQuant score",73.6880000,1.0000000,-0.4208199,0.6471800,NO,1.2805799997295E-5,-0.2590600
GNEFEDYFLKR,ac,K,132,false,"Quantitative Acetylproteomics",101,29440448,,,,,,,,
ELALQTSQVCK,sno,C,212,false,"hot5-4 / wildtype, FAT-switch S-nitrosoproteome",169,37277371,,,,,,,,
ELALQTSQVCK,so,C,212,false,"Arabidopsis S-sulfenylation chemoproteomics",108,31578252,"pFind PSM Score",0.0010886,,,,,,-1.8036796
ELALQTSQVCK,so,C,212,false,"S-sulfenylation site detection using YAP1C",110,32714340,,,,,,,,
LHQPVHLLVGTPGR,ph,T,249,true,"Tissue atlas Arabidopsis - ProteomicsDB",114,32188942,"MaxQuant score",103.7100000,1.0000000,,,,5.0619899411686E-5,
VHCLNTLFSK,so,C,351,false,"Arabidopsis S-sulfenylation chemoproteomics",108,31578252,"pFind PSM Score",0.0376201,,1.4084500,,,,-0.8115269
NLVCTDLFTR,sno,C,417,false,"Site-specific nitrosomeproteomic id - gsnor1-3",90a,25699590,XCorr,2.9017501,,,,,0.00024009999469854,-6.2701116
NLVCTDLFTR,so,C,417,false,"Arabidopsis S-sulfenylation chemoproteomics",108,31578252,"pFind PSM Score",0.0142177,,1.0309300,,,,-1.1570934
NLVCTDLFTR,so,C,417,false,"S-sulfenylation site detection using YAP1C",110,32714340,,,,,,,,
