Peptide,PTM,ModifiedAA,ModifiedPosition,PeptideUniqueToGene,ExperimentDesc,ExpID,PubmedID,ScoreType,IdentScore,LocProb,Log2FChange,PQ-val,QuantSig,PEP,MassErrorPPM
AEETPRYAVVTGANRGIGFE,nta,A,2,true,"Arabidopsis translation initiation landscape - NTA",167a,35069635,,,,,,,,
AEETPRYAVVTGAN,nta,A,2,true,"HUNTER N-terminome: legumain, GluC and trypsin",119,31951383,"MaxQuant score",216.8400000,,,,,,
GIGFEICR,so,C,23,false,"Arabidopsis S-sulfenylation chemoproteomics",108,31578252,"pFind PSM Score",0.0672720,,0.8474600,,,,-1.3888684
GIGFEICR,so,C,23,false,"S-sulfenylation site detection using YAP1C",110,32714340,,,,,,,,
MCEAFIPLLK,ox,C,144,true,"SPEAR - 50 mM H2O2 / mock",138b,34619326,,,,4.0859362,0.0003098,YES,,
MCEAFIPLLK,sno,C,144,true,"Site-specific nitrosomeproteomic id - gsnor1-3",90a,25699590,XCorr,3.0188520,,,,,5.6670000958547E-6,-6.9639694
MCEAFIPLLKLSDSPR,ub,K,152,true,"upl3 mutant / wildtype",168,35926874,"MaxQuant score",83.5400000,1.0000000,,,,9.2948403107584E-6,0.6836500
VNAVCPGFVK,ox,C,247,true,"SPEAR - 10 mM H2O2 / mock",138a,34619326,,,,5.6903665,0.0067425,YES,,
VNAVCPGFVK,ox,C,247,true,"SPEAR - 50 mM H2O2 / mock",138b,34619326,,,,5.0715822,0.0135198,YES,,
VNAVCPGFVK,sno,C,247,true,"hot5-4 / wildtype, FAT-switch S-nitrosoproteome",169,37277371,,,,-0.2799194,0.1895989,NO,,
TDMNFKTGVLSVEEGASSPVR,ub,K,258,true,"upl3 mutant / wildtype",168,35926874,"MaxQuant score",69.0880000,1.0000000,-0.1376478,0.8441200,NO,1.548980071675E-5,-1.0634000
TGVLSVEEGASSPVR,ph,S,270,true,"Tissue atlas Arabidopsis - ProteomicsDB",114,32188942,"MaxQuant score",234.5700000,0.9153760,,,,0,
