Peptide,PTM,ModifiedAA,ModifiedPosition,PeptideUniqueToGene,ExperimentDesc,ExpID,PubmedID,ScoreType,IdentScore,LocProb,Log2FChange,PQ-val,QuantSig,PEP,MassErrorPPM
MERDEEASGPMMEMCTNGGEETSNR,nta,M,1,true,"Arabidopsis translation initiation landscape - NTA",167a,35069635,,,,,,,,
EVVNKIGNR,ub,K,92,true,"Arabidopsis ubiquitination COFRADIC",40,26744219,"MaxQuant Score",101.7200000,1.0000000,,,,0.003000000026077,0.2940000
TNLIKESIR,ub,K,135,true,"Arabidopsis ubiquitination COFRADIC",40,26744219,"MaxQuant Score",68.6570000,1.0000000,,,,0.010999999940395,0.4600000
DYCTTTK,sno,C,169,true,"hot5-4 / wildtype, FAT-switch S-nitrosoproteome",169,37277371,,,,,,,,
CASGLAHLELKK,so,C,219,true,"S-sulfenylation site detection using YAP1C",110,32714340,,,,,,,,
SELKQKVIDNINFR,nt,S,273,true,"Arabidopsis translation initiation landscape - NT",167b,35069635,,,,,,,,
YASCLEYLASLK,so,C,310,true,"S-sulfenylation site detection using YAP1C",110,32714340,,,,,,,,
MADAFKTSVSGLEK,ac,K,363,true,"Quantitative Acetylproteomics",101,29440448,,,,,,,,
DSHNKILYARHA,nt,D,387,true,"Arabidopsis translation initiation landscape - NT",167b,35069635,,,,,,,,
