Peptide,PTM,ModifiedAA,ModifiedPosition,PeptideUniqueToGene,ExperimentDesc,ExpID,PubmedID,ScoreType,IdentScore,LocProb,Log2FChange,PQ-val,QuantSig,PEP,MassErrorPPM
LANECK,sno,C,37,true,"hot5-4 / wildtype, FAT-switch S-nitrosoproteome",169,37277371,,,,,,,,
IIEPAIDCIQK,sno,C,109,true,"hot5-4 / wildtype, FAT-switch S-nitrosoproteome",169,37277371,,,,0.1165734,0.8158216,NO,,
LIDSVCK,sno,C,142,true,"hot5-4 / wildtype, FAT-switch S-nitrosoproteome",169,37277371,,,,,,,,
CHDLGDESIELPVLK,sno,C,144,true,"hot5-4 / wildtype, FAT-switch S-nitrosoproteome",169,37277371,,,,0.1087978,0.5378722,NO,,
YWEISMYK,ph,S,313,false,"Tissue atlas Arabidopsis - ProteomicsDB",114,32188942,"MaxQuant score",97.4560000,1.0000000,,,,0.0082827098667622,
KGELTDGDAERDDDLEVQIENK,ph,T,327,true,"Tissue atlas Arabidopsis - ProteomicsDB",114,32188942,"MaxQuant score",43.2560000,1.0000000,,,,0.0038109100423753,
DACLVFR,sno,C,350,true,"hot5-4 / wildtype, FAT-switch S-nitrosoproteome",169,37277371,,,,,,,,
LPVSNSLNK,ph,S,565,true,"Tissue atlas Arabidopsis - ProteomicsDB",114,32188942,"MaxQuant score",106.3800000,0.9528390,,,,0.00064855697564781,
GSYDSMSLGGK,ph,S,1036,true,"Tissue atlas Arabidopsis - ProteomicsDB",114,32188942,"MaxQuant score",74.0770000,0.9975690,,,,0.002083359984681,
GSYDSMSLGGK,ph,S,1039,true,"Tissue atlas Arabidopsis - ProteomicsDB",114,32188942,"MaxQuant score",75.0880000,0.9587360,,,,0.0019447200465947,
CVSQMVLSR,acy,C,1205,false,"Arabidopsis S-acylation atlas - Meristem",163a,35681017,,,,,,,,
CVSQMVLSR,acy,C,1205,false,"Arabidopsis S-acylation atlas - Silique",163e,35681017,,,,,,,,
LAEGDLNSPSTNK,ph,S,1307,true,"atm and atr DNA damage response",88,25561503,"MASCOT Score",29.0000000,1.0000000,,,,,-0.9200000
LAEGDLNSPSTNK,ph,S,1307,true,"Lateral root-induction - NAA vs control",106,23328941,"MASCOT Score",32.0000000,,,,,,
LAEGDLNSPSTNK,ph,S,1307,true,"Tissue atlas Arabidopsis - ProteomicsDB",114,32188942,"MaxQuant score",255.3900000,0.9997800,,,,0,
LAEGDLNSPSTNKYK,ph,S,1309,true,"Tissue atlas Arabidopsis - ProteomicsDB",114,32188942,"MaxQuant score",245.2300000,0.8463430,,,,0,
LAEGDLNSPSTNK,ph,S,1309,true,"Lateral root-induction - NAA vs control",106,23328941,"MASCOT Score",37.0000000,,,,,,
LAEGDLNSPSTNKYK,ph,T,1310,true,"Tissue atlas Arabidopsis - ProteomicsDB",114,32188942,"MaxQuant score",120.2100000,0.9200120,,,,4.496930159803E-6,
GTSGKIPQSSLHSGK,ph,S,1317,true,"Tissue atlas Arabidopsis - ProteomicsDB",114,32188942,"MaxQuant score",132.6100000,0.9999490,,,,4.5242700252857E-7,
WRIPLGSGK,ph,S,1721,true,"Tissue atlas Arabidopsis - ProteomicsDB",114,32188942,"MaxQuant score",93.6140000,1.0000000,,,,0.00047510999138467,
