Peptide,PTM,ModifiedAA,ModifiedPosition,PeptideUniqueToGene,ExperimentDesc,ExpID,PubmedID,ScoreType,IdentScore,LocProb,Log2FChange,PQ-val,QuantSig,PEP,MassErrorPPM
ANWSPYDNNGGTCVAIAGSDYCVIAADTR,nt,A,6,true,"HUNTER N-terminome: legumain, GluC and trypsin",119,31951383,"MaxQuant score",189.4500000,,,,,,
VLGGLDEE,nt,V,115,true,"Arg/N-end rule seed, prt6 vs. Wt",99,29168982,"MASCOT Score",45.2000000,,-0.8645188,0.2096378,NO,0.029920000582933,-0.2188880
SPSPLLLPK,ph,S,163,true,"STN8 phosphoproteome",38,21768351,"MASCOT Score",40.6400000,,,,,,0.4373760
SPSPLLLPK,ph,S,163,true,"Chloroplast kinase substrates",60,19376835,"MASCOT Score",38.7000000,,,,,,-0.0662260
SPSPLLLPK,ph,S,163,true,"srk2dei ABA signaling phopshoproteomics",83,23572148,"MASCOT Score",42.0000000,,,,,,0.0006000
SPSPLLLPK,ph,S,163,true,"atm and atr DNA damage response",88,25561503,"MASCOT Score",38.0000000,1.0000000,,,,,-0.7300000
SPSPLLLPK,ph,S,163,true,"TOR Kinase and ABA Receptor",100,29290610,XCorr,3.1048901,0.9998000,,,,9.0339999587741E-5,
SPSPLLLPK,ph,S,163,true,"Lateral root-induction - NAA vs control",106,23328941,"MASCOT Score",23.0000000,,,,,,
SPSPLLLPK,ph,S,163,true,"Phospho cell culture sucrose/TOR",109,30833711,,,0.9998550,,,,,
SPSPLLLPK,ph,S,163,true,"Tissue atlas Arabidopsis - ProteomicsDB",114,32188942,"MaxQuant score",215.9600000,1.0000000,,,,5.6904998890872E-23,
QDSNTPLSEAEAVDLVK,ph,T,174,true,"Tissue atlas Arabidopsis - ProteomicsDB",114,32188942,"MaxQuant score",125.1800000,0.9786580,,,,4.0301402215448E-9,
ADGIKTELMDLR,ub,K,214,true,"upl3 mutant / wildtype",168,35926874,"MaxQuant score",74.7800000,1.0000000,-2.7178568,,,0.00028394401306286,-0.1113100
