Peptide,PTM,ModifiedAA,ModifiedPosition,PeptideUniqueToGene,ExperimentDesc,ExpID,PubmedID,ScoreType,IdentScore,LocProb,Log2FChange,PQ-val,QuantSig,PEP,MassErrorPPM
ASTSSLALSQALLAR,nta,A,2,true,"FtsH12 N-terminome: WT / FtsH12 knockdown miRNA",118,33216923,"MaxQuant score",133.8400000,,,,,0,
AAAVETVEPTTDSSIVDKSVNSIRF,nt,A,66,true,"Arabidopsis translation initiation landscape - NT",167b,35069635,,,,,,,,
AAAVETVEPTTDSSIVDKSVNSIR,nt,A,66,true,"Stromal N-terminome",96,26371235,"MASCOT Score",87.7000000,,,,,,
AAAVETVEPTTDSSIVDKSVNSIR,nt,A,66,true,"HUNTER N-terminome: legumain, GluC and trypsin",119,31951383,"MaxQuant score",48.5000000,,,,,,
AAAVETVEPTTDSSIVDKSVN,nt,A,66,true,"Arg/N-end rule seed, prt6 vs. Wt",99,29168982,"MASCOT Score",44.7300000,,-0.1129670,0.8371404,NO,0.010329999960959,-2.2955859
AAAVETVEPTTDSSIVDKSVN,nt,A,66,true,"HUNTER N-terminome: legumain, GluC and trypsin",119,31951383,"MaxQuant score",86.6250000,,,,,,
AAAVETVEPTTDSSIVDK,nta,A,66,true,"Characterization plant N-terminal acetylation",6,22223895,"MASCOT Score",45.8700000,,,,,,
AAVETVEPTTDSSIVDKSVNSIRFLAID,nt,A,67,true,"HUNTER N-terminome: legumain, GluC and trypsin",119,31951383,"MaxQuant score",47.0180000,,,,,,
AAVETVEPTTDSSIVDKSVNSIRFL,nt,A,67,true,"N-terminal ChaFRADIC",92,26010716,"MASCOT Score",35.5500000,,,,,4.4519998768127E-17,
AAVETVEPTTDSSIVDKSVNSIRFL,nt,A,67,true,"Arabidopsis translation initiation landscape - NT",167b,35069635,,,,,,,,
AAVETVEPTTDSSIVDKSVNSIR,nt,A,67,true,"Arg/N-end rule pathway Roots",80,25728785,"MASCOT Score",52.3800000,,,,,0.00070959998993203,
AAVETVEPTTDSSIVDKSVNSIR,nt,A,67,true,"N-terminal ChaFRADIC",92,26010716,"MASCOT Score",52.0000000,,,,,4.0140000123756E-7,
AAVETVEPTTDSSIVDKSVNSIR,nt,A,67,true,"Stromal N-terminome",96,26371235,"MASCOT Score",88.2300000,,,,,,
AAVETVEPTTDSSIVDKSVNSIR,nt,A,67,true,"Arg/N-end rule seed, prt6 vs. Wt",99,29168982,"MASCOT Score",44.4800000,,0.5346543,0.0128243,NO,0.00041770000825636,-1.4946605
AAVETVEPTTDSSIVDKSVNSIR,nt,A,67,true,"FtsH12 N-terminome: WT / FtsH12 knockdown miRNA",118,33216923,"MaxQuant score",59.8000000,,-0.2045773,0.2187331,NO,0.0044891000725329,
AAVETVEPTTDSSIVDKSVNSIR,nt,A,67,true,"HUNTER N-terminome: legumain, GluC and trypsin",119,31951383,"MaxQuant score",268.5800000,,,,,,
AAVETVEPTTDSSIVDKSVN,nt,A,67,true,"HUNTER N-terminome: legumain, GluC and trypsin",119,31951383,"MaxQuant score",359.8600000,,,,,,
AAVETVEPTTDSSIVDK,nt,A,67,true,"N-terminal ChaFRADIC",92,26010716,"MASCOT Score",30.4400000,,,,,8.8839999534684E-7,
AAVETVEPTTDSSIVDK,nt,A,67,true,"Stromal N-terminome",96,26371235,"MASCOT Score",53.0500000,,,,,,
AAVETVEPTTDSSIVD,nt,A,67,true,"HUNTER N-terminome: legumain, GluC and trypsin",119,31951383,"MaxQuant score",210.0800000,,,,,,
AAVETVEPT,nt,A,67,true,"N-terminal ChaFRADIC",92,26010716,"MASCOT Score",38.0700000,,,,,1.0490000022401E-5,
AAVETVEPTTDSSIVDKSVNSIR,nta,A,67,true,"N-terminal ChaFRADIC",92,26010716,"MASCOT Score",52.0000000,,,,,4.0140000123756E-7,
AAVETVEPTTDSSIVDKSVNSIR,nta,A,67,true,"HUNTER N-terminome: legumain, GluC and trypsin",119,31951383,"MaxQuant score",54.8690000,,,,,,
AAVETVEPTTDSSIVDKSVN,nta,A,67,true,"HUNTER N-terminome: legumain, GluC and trypsin",119,31951383,"MaxQuant score",65.1720000,,,,,,
AAVETVEPTTDSSIVDK,nta,A,67,true,"Characterization plant N-terminal acetylation",6,22223895,"MASCOT Score",80.7500000,,,,,,
AAVETVEPTTDSSIVDK,nta,A,67,true,"Stromal N-terminome",96,26371235,"MASCOT Score",53.0500000,,,,,,
AAVETVEPTTD,nta,A,67,true,"HUNTER N-terminome: legumain, GluC and trypsin",119,31951383,"MaxQuant score",161.0200000,,,,,,
AVETVEPTTDSSIVDKSVNSIRF,nt,A,68,true,"Arabidopsis translation initiation landscape - NT",167b,35069635,,,,,,,,
AVETVEPTTDSSIVDKSVNSIR,nt,A,68,true,"Arg/N-end rule pathway Roots",80,25728785,"MASCOT Score",50.1200000,,,,,0.00016300000424962,
AVETVEPTTDSSIVDKSVNSIR,nt,A,68,true,"N-terminal ChaFRADIC",92,26010716,"MASCOT Score",41.6000000,,,,,1.9079999895571E-13,
AVETVEPTTDSSIVDKSVNSIR,nt,A,68,true,"Stromal N-terminome",96,26371235,"MASCOT Score",73.6300000,,,,,,
AVETVEPTTDSSIVDKSVNSIR,nt,A,68,true,"FtsH12 N-terminome: WT / FtsH12 knockdown miRNA",118,33216923,"MaxQuant score",62.3380000,,,,,0.0036450999323279,
AVETVEPTTDSSIVDKSVNSIR,nt,A,68,true,"HUNTER N-terminome: legumain, GluC and trypsin",119,31951383,"MaxQuant score",135.4200000,,,,,,
AVETVEPTTDSSIVDKSVN,nt,A,68,true,"HUNTER N-terminome: legumain, GluC and trypsin",119,31951383,"MaxQuant score",212.1700000,,,,,,
AVETVEPTTD,nt,A,68,true,"N-terminal ChaFRADIC",92,26010716,"MASCOT Score",24.3600000,,,,,0.0049250000156462,
AVETVEPT,nt,A,68,true,"N-terminal ChaFRADIC",92,26010716,"MASCOT Score",44.8700000,,,,,0.0023109999019653,
AVETVEPTTDSSIVDKSVNSIR,nta,A,68,true,"N-terminal ChaFRADIC",92,26010716,"MASCOT Score",41.4100000,,,,,4.2849998749261E-7,
FLAIDAVEKAK,ac,K,98,false,"Histone deacetylases - apicidin vs control",98a,29061669,"MaxQuant Score",104.2000000,1.0000000,0.1000000,0.5345644,NO,3.0999999012238E-7,
FLAIDAVEKAK,ac,K,98,false,"Histone deacetylases substrates - hda14 vs WT",98e,29061669,"MaxQuant Score",42.1000000,1.0000000,0.2780000,0.5821032,NO,0.010999999940395,
FLAIDAVEKAK,ac,K,98,false,"Quantitative Acetylproteomics",101,29440448,,,,,,,,
SGHPGLPMGCAPMAHILYDEVMR,cn,C,110,true,"Cellular regulation by S-cyanylation",115,30377236,,,,,,,,
SGHPGLPMGCAPMAHILYDEVMR,sno,C,110,true,"Site-specific nitrosomeproteomic id - gsnor1-3",90b,25699590,XCorr,3.6100000,,,,,1.204999989568E-5,-7.5600000
APMAHILYDE,nt,A,111,true,"Arg/N-end rule seed, prt6 vs. Wt",99,29168982,"MASCOT Score",30.1900000,,-0.1398069,0.4643296,NO,0.0030829999595881,-0.3702001
ALLHLAGYDSVQEEDLKQFR,nt,A,150,true,"Arabidopsis translation initiation landscape - NT",167b,35069635,,,,,,,,
HLAGYDSVQE,nt,H,153,true,"Arg/N-end rule seed, prt6 vs. Wt",99,29168982,"MASCOT Score",59.9300000,,-0.0466930,0.6799205,NO,2.9680000807275E-5,-1.7220076
HLAGYDSVQEEDLKQFR,nta,H,153,true,"FtsH12 N-terminome: WT / FtsH12 knockdown miRNA",118,33216923,"MaxQuant score",127.2300000,,,,,0,
GYDSVQEEDLKQFR,nt,G,156,true,"Arg/N-end rule seed, prt6 vs. Wt",99,29168982,"MASCOT Score",33.6400000,,0.0223006,0.9372986,NO,0.013249999843538,-2.0056891
GYDSVQEEDLKQFR,nt,G,156,true,"FtsH12 N-terminome: WT / FtsH12 knockdown miRNA",118,33216923,"MaxQuant score",58.0800000,,-0.5742052,0.0430012,NO,3.5000000480068E-6,
SKTPGHPE,nt,S,173,false,"Arabidopsis translation initiation landscape - NT",167b,35069635,,,,,,,,
AVGLALAE,nt,A,201,false,"Arg/N-end rule seed, prt6 vs. Wt",99,29168982,"MASCOT Score",52.1800000,,-0.2589526,0.6558714,NO,0.018020000308752,0.4986487
HISIDGDTE,nt,H,264,true,"Arg/N-end rule seed, prt6 vs. Wt",99,29168982,"MASCOT Score",55.9700000,,-0.4737282,0.2716577,NO,0.0010039999615401,-1.2947188
TEIAFTENVDQR,nt,T,271,true,"Stromal N-terminome",96,26371235,"MASCOT Score",61.4900000,,,,,,
TEIAFTENVDQR,nt,T,271,true,"FtsH12 N-terminome: WT / FtsH12 knockdown miRNA",118,33216923,"MaxQuant score",84.4100000,,,,,7.1099998422142E-6,
EAKTVTDKPTLIK,ac,K,311,true,"Quantitative Acetylproteomics",101,29440448,,,,,,,,
TVTDKPTLIK,ac,K,316,true,"Histone deacetylases - apicidin vs control",98a,29061669,"MaxQuant Score",81.6000000,1.0000000,0.0650000,0.6839116,NO,0.00028000000747852,
TVTDKPTLIK,ac,K,316,true,"Histone deacetylases substrates - TSA vs control",98b,29061669,"MaxQuant Score",81.6000000,1.0000000,0.0230000,0.9977001,NO,0.00028000000747852,
TVTDKPTLIK,ac,K,316,true,"Histone deacetylases- hda14 vs WT (low light)",98c,29061669,"MaxQuant Score",102.4600000,1.0000000,-0.2210000,0.9885531,NO,0.0049999998882413,
TVTDKPTLIK,ac,K,316,true,"Histone deacetylases substrates - hda14 vs WT",98e,29061669,"MaxQuant Score",52.2000000,1.0000000,-0.0170000,0.9727472,NO,0.0080000003799796,
TVTDKPTLIK,ac,K,321,true,"Quantitative Acetylproteomics",101,29440448,,,,,,,,
VTTTIGYGSPNK,ph,S,330,false,"Tissue atlas Arabidopsis - ProteomicsDB",114,32188942,"MaxQuant score",78.5050000,0.9791050,,,,0.0017294699791819,
VTTTIGYGSPNKANSYSVHGAALGEK,ac,K,333,false,"Quantitative Acetylproteomics",101,29440448,,,,,,,,
SVHGAALGEKEVEATR,nt,S,338,false,"Arabidopsis translation initiation landscape - NT",167b,35069635,,,,,,,,
ANSYSVHGAALGEK,ph,S,338,false,"TOR Kinase and ABA Receptor",100,29290610,XCorr,2.9361944,0.9958000,,,,4.2470001062611E-5,
GAALGEKEVEATR,nt,G,341,false,"Arg/N-end rule seed, prt6 vs. Wt",99,29168982,"MASCOT Score",35.3900000,,-0.7190142,0.3104502,NO,0.0014009999576956,-0.7150250
GAALGEKEVEATR,nt,G,341,false,"Arabidopsis translation initiation landscape - NT",167b,35069635,,,,,,,,
ANSYSVHGAALGEKEVEATR,ac,K,347,false,"Histone deacetylases substrates - TSA vs control",98b,29061669,"MaxQuant Score",75.5000000,1.0000000,0.1320000,0.9977001,NO,2.0999999517102E-9,
ANSYSVHGAALGEKEVEATR,ac,K,347,false,"Histone deacetylases- hda14 vs WT (low light)",98c,29061669,"MaxQuant Score",219.2300000,1.0000000,1.3200000,0.7744618,NO,3.3000000856962E-30,
ANSYSVHGAALGEKEVEATR,cr,K,347,false,"Open search Plant PTM Viewer 2.0 - Crotonylation",164c,TBA,,,,,,,,
SRHTPEGATLES,nt,S,374,true,"Arabidopsis translation initiation landscape - NT",167b,35069635,,,,,,,,
HTPEGATLESDWSAK,ac,K,390,true,"Quantitative Acetylproteomics",101,29440448,,,,,,,,
HTPEGATLESDWSAKFAAYEK,cr,K,390,true,"Open search Plant PTM Viewer 2.0 - Crotonylation",164c,TBA,,,,,,,,
FAAYEKK,ac,K,396,false,"Quantitative Acetylproteomics",101,29440448,,,,,,,,
KYPEEASELK,ac,K,397,true,"Histone deacetylases - apicidin vs control",98a,29061669,"MaxQuant Score",91.3000000,1.0000000,-0.0570000,0.7464488,NO,0.0060000000521541,
KYPEEASELK,ac,K,397,true,"Histone deacetylases- hda14 vs WT (low light)",98c,29061669,"MaxQuant Score",84.6100000,1.0000000,-0.3100000,0.9885531,NO,0.028000000864267,
KYPEEASELK,ph,S,403,true,"atm and atr DNA damage response",88,25561503,"MASCOT Score",53.0000000,1.0000000,,,,,-2.2900000
EKALPTYTPESPGDATR,nt,E,418,true,"N-terminal ChaFRADIC",92,26010716,"MASCOT Score",28.4700000,,,,,4.2650000978028E-5,
ALPTYTPESPGDATR,ph,T,425,true,"Lateral root-induction - NAA vs control",106,23328941,"MASCOT Score",34.0000000,,,,,,
ALPTYTPESPGDATR,ph,T,425,true,"Tissue atlas Arabidopsis - ProteomicsDB",114,32188942,"MaxQuant score",132.0500000,0.9993530,,,,5.0468697736505E-6,
ALPTYTPESPGDATR,ph,S,428,true,"STN8 phosphoproteome",38,21768351,"MASCOT Score",73.5600000,,,,,,-1.1947500
ALPTYTPESPGDATR,ph,S,428,true,"Tyrosine phosphorylation in Arabidopsis",59,18463617,"MASCOT Score",66.0000000,,,,,,-0.9669296
ALPTYTPESPGDATR,ph,S,428,true,"Chloroplast kinase substrates",60,19376835,"MASCOT Score",57.8800000,,,,,,-1.1464600
ALPTYTPESPGDATR,ph,S,428,true,"srk2dei ABA signaling phopshoproteomics",83,23572148,"MASCOT Score",81.0000000,,,,,,-0.0007000
ALPTYTPESPGDATR,ph,S,428,true,"LAXIC - ABA stress",84a,23660473,XCorr,4.1500000,1.0000000,,,,0.0001137400031439,
ALPTYTPESPGDATR,ph,S,428,true,"SnRK2 protein kinase substrates",85,23776212,XCorr,3.8072965,1.0000000,,,,2.095300004612E-7,
ALPTYTPESPGDATR,ph,S,428,true,"atm and atr DNA damage response",88,25561503,"MASCOT Score",67.0000000,1.0000000,,,,,-0.7300000
ALPTYTPESPGDATR,ph,S,428,true,"TOR Kinase and ABA Receptor",100,29290610,XCorr,3.5938418,0.9899000,,,,1.6770000001998E-5,
ALPTYTPESPGDATR,ph,S,428,true,"Lateral root-induction - NAA vs control",106,23328941,"MASCOT Score",58.0000000,,,,,,
ALPTYTPESPGDATR,ph,S,428,true,"Phospho cell culture sucrose/TOR",109,30833711,,,0.9974760,,,,,
ALPTYTPESPGDATR,ph,S,428,true,"Tissue atlas Arabidopsis - ProteomicsDB",114,32188942,"MaxQuant score",226.7000000,0.9998820,,,,0,
ALPTYTPESPGDATR,ph,S,428,true,"Touch-induced phosphorylation: 40s touch vs untouc",136,30291188,"MASCOT score",63.2500000,,-0.0805965,0.3461995,NO,,5.4501796
ALPTYTPESPGDATR,ph,T,433,true,"srk2dei ABA signaling phopshoproteomics",83,23572148,"MASCOT Score",32.0000000,,,,,,-0.0004000
NLSQQCLNALAK,ph,S,437,false,"srk2dei ABA signaling phopshoproteomics",83,23572148,"MASCOT Score",86.0000000,,,,,,-0.0004000
NLSQQCLNALAK,ph,S,437,false,"atm and atr DNA damage response",88,25561503,"MASCOT Score",29.0000000,1.0000000,,,,,-0.5200000
NLSQQCLNALAK,ph,S,437,false,"TOR Kinase and ABA Receptor",100,29290610,XCorr,3.6819012,1.0000000,,,,0.00013760000001639,
NLSQQCLNALAK,ph,S,437,false,"Tissue atlas Arabidopsis - ProteomicsDB",114,32188942,"MaxQuant score",174.9000000,1.0000000,,,,3.8211799243998E-15,
NLSQQCLNALAK,cn,C,440,false,"Cellular regulation by S-cyanylation",115,30377236,,,,,,,,
NLSQQCLNALAK,ox,C,440,false,"OxiTRAQ Arabidopsis - 5 mM H2O2 versus control",47,24376095,,,,0.3739638,0.1328646,NO,,
NLSQQCLNALAK,sno,C,440,false,"Endogenous S-nitrosylation in Arabidopsis",64,22115780,"MASCOT Score",33.0000000,,,,,,
NLSQQCLNALAK,sno,C,440,false,"Cold stress nitrosylation - 4°C vs 22°C",65,24388526,,,,,,,,
NLSQQCLNALAK,sno,C,440,false,"Site-specific nitrosomeproteomic id - gsnor1-3",90a,25699590,XCorr,3.0773857,,,,,0.34499999880791,-6.8384373
NLSQQCLNALAK,sno,C,440,false,"hot5-4 / wildtype, FAT-switch S-nitrosoproteome",169,37277371,,,,-0.5496883,0.0175350,NO,,
NLSQQCLNALAK,so,C,440,false,"Arabidopsis S-sulfenylation chemoproteomics",108,31578252,"pFind PSM Score",0.0052241,,0.8953900,,,,-0.5819901
NLSQQCLNALAK,so,C,440,false,"S-sulfenylation site detection using YAP1C",110,32714340,,,,,,,,
VVPGFLGGSADLASSNMTLLK,ph,S,460,true,"TOR Kinase and ABA Receptor",100,29290610,XCorr,4.7008920,0.9186000,,,,1.3810000254466E-8,
VVPGFLGGSADLASSNMTLLKAFGDFQK,ac,K,467,true,"Histone deacetylases substrates - TSA vs control",98b,29061669,"MaxQuant Score",91.4000000,1.0000000,0.2650000,0.9772372,NO,4.1000001634647E-30,
VVPGFLGGSADLASSNMTLLKAFGDFQK,ac,K,467,true,"Histone deacetylases substrates - hda14 vs WT",98e,29061669,"MaxQuant Score",132.3000000,1.0000000,-0.0480000,0.9705100,NO,0,
AFGDFQKATPEER,nt,A,468,true,"Arabidopsis translation initiation landscape - NT",167b,35069635,,,,,,,,
AFGDFQKATPEER,ac,K,474,true,"Histone deacetylases - apicidin vs control",98a,29061669,"MaxQuant Score",142.5000000,1.0000000,0.0520000,0.7362071,NO,9.5000000771757E-23,
AFGDFQKATPEER,ac,K,474,true,"Histone deacetylases substrates - TSA vs control",98b,29061669,"MaxQuant Score",142.5000000,1.0000000,-0.1110000,0.9977001,NO,9.5000000771757E-23,
AFGDFQKATPEER,ac,K,474,true,"Histone deacetylases- hda14 vs WT (low light)",98c,29061669,"MaxQuant Score",194.4800000,1.0000000,-0.9250000,0.9885531,NO,3.6000000723513E-12,
AFGDFQKATPEER,ac,K,474,true,"Histone deacetylases substrates - hda14 vs WT",98e,29061669,"MaxQuant Score",153.1000000,1.0000000,-0.0780000,0.9120108,NO,1.3000000556892E-37,
THDSIGLGEDGPTHQPIEHIA,nt,T,538,true,"N-terminal ChaFRADIC",92,26010716,"MASCOT Score",20.2200000,,,,,6.5299998659276E-16,
SIGLGEDGPTHQPIEHIASFR,nt,S,541,true,"Stromal N-terminome",96,26371235,"MASCOT Score",45.3000000,,,,,,
SIGLGEDGPTHQPIEHIA,nt,S,541,true,"N-terminal ChaFRADIC",92,26010716,"MASCOT Score",25.6900000,,,,,1.978000057079E-7,
SIGLGEDGPTHQPIE,nt,S,541,false,"Arabidopsis translation initiation landscape - NT",167b,35069635,,,,,,,,
PADGNETAGAYKIAVTKR,nt,P,571,false,"Arabidopsis translation initiation landscape - NT",167b,35069635,,,,,,,,
KTPSILALSR,nt,K,589,true,"Stromal N-terminome",96,26371235,"MASCOT Score",33.9900000,,,,,,
KTPSILALSR,ph,S,597,true,"atm and atr DNA damage response",88,25561503,"MASCOT Score",37.0000000,0.8590000,,,,,-0.4200000
QKLPHLPGTSIE,nt,Q,599,true,"HUNTER N-terminome: legumain, GluC and trypsin",119,31951383,"MaxQuant score",,,,,,,
QKLPHLPGTSIEGVEK,ac,K,600,true,"Histone deacetylases- hda14 vs WT (low light)",98c,29061669,"MaxQuant Score",145.9100000,1.0000000,-0.1640000,0.9885531,NO,9.0999999202701E-11,
QKLPHLPGTSIEGVEK,ac,K,600,true,"Quantitative Acetylproteomics",101,29440448,,,,,,,,
SIEGVEKG,nt,S,608,true,"N-terminal ChaFRADIC",92,26010716,"MASCOT Score",26.6700000,,,,,0.047359999269247,
SIEGVEK,nt,S,608,false,"N-terminal ChaFRADIC",92,26010716,"MASCOT Score",27.5700000,,,,,0.010540000163019,
QKLPHLPGTSIEGVEK,ph,S,608,true,"Tissue atlas Arabidopsis - ProteomicsDB",114,32188942,"MaxQuant score",43.1160000,0.8216760,,,,0.0040031601674855,
VSIEAASTFGWGK,ph,S,693,true,"Tissue atlas Arabidopsis - ProteomicsDB",114,32188942,"MaxQuant score",127.3600000,0.8486860,,,,6.5941901993938E-5,
GKSIGINSFGASAPAPLLYK,ac,K,706,true,"Quantitative Acetylproteomics",101,29440448,,,,,,,,
SIGINSFGASAPAPLLYK,ph,S,712,true,"STN8 phosphoproteome",38,21768351,"MASCOT Score",45.0700000,,,,,,-1.9382500
SIGINSFGASAPAPLLYK,ph,S,712,true,"TOR Kinase and ABA Receptor",100,29290610,XCorr,5.0612445,0.9985000,,,,1.9790000749254E-8,
