Peptide,PTM,ModifiedAA,ModifiedPosition,PeptideUniqueToGene,ExperimentDesc,ExpID,PubmedID,ScoreType,IdentScore,LocProb,Log2FChange,PQ-val,QuantSig,PEP,MassErrorPPM
VPFIVLHGIGDKCSNAGVTQFTE,nt,V,23,true,"Arabidopsis translation initiation landscape - NT",167b,35069635,,,,,,,,
GIGDKCSNAGVTQFTE,nt,G,30,true,"Arg/N-end rule seed, prt6 vs. Wt",99,29168982,"MASCOT Score",31.5200000,,-0.9047762,0.0985516,NO,0.0027379998937249,-1.0141751
ALIEFCDGAPPVK,sno,C,112,true,"hot5-4 / wildtype, FAT-switch S-nitrosoproteome",169,37277371,,,,0.2126627,0.4514761,NO,,
LNNELPVKNSTYKER,ng,N,196,true,"Conserved N-glycosylation",74,22633491,"MaxQuant Score",166.7500000,1.0000000,,,,3.7569999171243E-23,0.0440000
LNNELPVKNSTYKER,ng,N,196,true,"N-Glycopeptide Profiling in Arabidopsis Infloresce",132,27067053,"MOWSE score",35.0000000,,,,,0.00030000001424924,
LNNELPVKNSTYK,ng,N,196,true,"N-Glycopeptide Profiling in Arabidopsis Infloresce",132,27067053,"MOWSE score",23.2000000,,,,,0.0057000000961125,
LNNELPVKNSTYK,ng,N,196,true,"N-linked Glycan Micro-heterogeneity Arabidopsis",134,29237727,,,,,,,,
LNNELPVKNSTYK,ng,N,196,true,"UDP-GlcNAc transporter glycopeptide analysis",135,30224661,,,,,,,2.6419600014649E-13,0.4000000
FVNVSGNHLQISHTDMKK,ng,N,268,true,"Conserved N-glycosylation",74,22633491,"MaxQuant Score",158.4700000,1.0000000,,,,1.116999949026E-38,-0.2450000
FVNVSGNHLQISHTDMK,ng,N,268,true,"N-Glycopeptide Profiling in Arabidopsis Infloresce",132,27067053,"MOWSE score",31.5000000,,,,,0.012000000104308,
FVNVSGNHLQISHTDMK,ng,N,268,true,"N-linked Glycan Micro-heterogeneity Arabidopsis",134,29237727,,,,,,,,
FVNVSGNHLQISHTDMK,ng,N,268,true,"UDP-GlcNAc transporter glycopeptide analysis",135,30224661,,,,,,,5.5484411459904E-16,0.5000000
