Peptide,PTM,ModifiedAA,ModifiedPosition,PeptideUniqueToGene,ExperimentDesc,ExpID,PubmedID,ScoreType,IdentScore,LocProb,Log2FChange,PQ-val,QuantSig,PEP,MassErrorPPM
TTMESLIGLVNR,nt,T,2,true,"Tic56 chloroplast import - wild-type",89a,25588737,XCorr,2.9470589,,,,,,
TTMESLIGLVNR,nt,T,2,true,"Tic56 chloroplast import - ppi2",89b,25588737,XCorr,2.7948542,,,,,,
TTMESLIGLVNR,nt,T,2,true,"Stromal N-terminome",96,26371235,"MASCOT Score",53.5600000,,,,,,
TTMESLIGLVNR,nt,T,2,true,"Arg/N-end rule seed, prt6 vs. Wt",99,29168982,"MASCOT Score",61.9300000,,,,,0.037420000880957,-0.9238732
TTMESLIGLVNR,nta,T,2,true,"Characterization plant N-terminal acetylation",6,22223895,"MASCOT Score",78.9600000,,,,,,
TTMESLIGLVNR,nta,T,2,true,"Arg/N-end rule pathway Roots",80,25728785,"MASCOT Score",50.7600000,,,,,0.00036080001154914,
TTMESLIGLVNR,nta,T,2,true,"Tic56 chloroplast import - wild-type",89a,25588737,XCorr,2.9470589,,,,,,
TTMESLIGLVNR,nta,T,2,true,"Tic56 chloroplast import - ppi2",89b,25588737,XCorr,2.7948542,,,,,,
TTMESLIGLVNR,nta,T,2,true,"Stromal N-terminome",96,26371235,"MASCOT Score",53.5600000,,,,,,
TTMESLIGLVNR,nta,T,2,true,"Arg/N-end rule seed, prt6 vs. Wt",99,29168982,"MASCOT Score",61.9300000,,,,,0.037420000880957,-0.9238732
TTMESLIGLVNR,nta,T,2,true,"HUNTER N-terminome: legumain, GluC and trypsin",119,31951383,"MaxQuant score",232.9700000,,,,,,
TTMESLIGLVNR,nta,T,2,true,"Arabidopsis translation initiation landscape - NTA",167a,35069635,,,,,,,,
LDLMDKGTNALEVLEGR,ph,T,226,true,"Phosphorylation in N starvation",63,22060019,"MASCOT Score",99.0000000,,,,,,-0.5669640
IYGVFDNQLPAALKK,ub,K,379,true,"upl3 mutant / wildtype",168,35926874,"MaxQuant score",46.7040000,1.0000000,-0.7933568,0.2148800,NO,0.0021897300612181,2.0788000
HLSLQSVK,ph,S,388,false,"Tissue atlas Arabidopsis - ProteomicsDB",114,32188942,"MaxQuant score",95.6180000,0.9997470,,,,0.0051428298465908,
KSISETEELKR,ub,K,445,false,"upl3 mutant / wildtype",168,35926874,"MaxQuant score",112.5000000,1.0000000,0.6294732,,,5.8217101468472E-5,0.5288300
KSISETEELKR,ac,K,454,false,"Quantitative Acetylproteomics",101,29440448,,,,,,,,
SISETEELKR,ac,K,454,false,"Quantitative Acetylproteomics",101,29440448,,,,,,,,
KLPQEIERPVTNSK,ph,T,510,true,"Tissue atlas Arabidopsis - ProteomicsDB",114,32188942,"MaxQuant score",56.7480000,0.9490540,,,,0.0037891999818385,
NQTASPSSATLDQYGDGHFR,ph,T,516,true,"Tissue atlas Arabidopsis - ProteomicsDB",114,32188942,"MaxQuant score",178.3500000,0.8343200,,,,1.4713633875411E-43,
NQTASPSSATLDQYGDGHFR,ph,S,518,true,"atm and atr DNA damage response",88,25561503,"MASCOT Score",48.0000000,0.9400000,,,,,-0.3700000
NQTASPSSATLDQYGDGHFR,ph,S,518,true,"Phospho cell culture sucrose/TOR",109,30833711,,,0.9414570,,,,,
NQTASPSSATLDQYGDGHFR,ph,S,518,true,"Tissue atlas Arabidopsis - ProteomicsDB",114,32188942,"MaxQuant score",299.5700000,0.9999560,,,,0,
NQTASPSSATLDQYGDGHFR,ph,S,520,true,"Large-scale phosphorylation discovery",44,23111157,XCorr,3.1460000,,,,,,
