Peptide,PTM,ModifiedAA,ModifiedPosition,PeptideUniqueToGene,ExperimentDesc,ExpID,PubmedID,ScoreType,IdentScore,LocProb,Log2FChange,PQ-val,QuantSig,PEP,MassErrorPPM
QGQTAFSFE,nt,Q,13,true,"HUNTER N-terminome: legumain, GluC and trypsin",119,31951383,"MaxQuant score",136.8000000,,,,,,
ALDLVNHIR,nt,A,131,false,"Arg/N-end rule seed, prt6 vs. Wt",99,29168982,"MASCOT Score",40.6400000,,-1.5878952,0.0004031,YES,0.21109999716282,-0.8084639
FVNDCR,sno,C,208,false,"hot5-4 / wildtype, FAT-switch S-nitrosoproteome",169,37277371,,,,,,,,
QIGINCPIVPGIMPISNYK,ox,C,215,true,"SPEAR - 10 mM H2O2 / mock",138a,34619326,,,,2.8192785,0.0129838,YES,,
MAGFCK,so,C,237,true,"Arabidopsis S-sulfenylation chemoproteomics",108,31578252,"pFind PSM Score",0.3593870,,,,,,0.4701783
TKEDVRPIFWANRPK,ub,K,324,false,"upl3 mutant / wildtype",168,35926874,"MaxQuant score",50.6590000,1.0000000,-0.0831412,,,0.0015336100477725,1.1134000
EDVRPIFWANRPKSYISR,ph,S,338,false,"Arabidopsis root NAA phosphoproteome",18a,27643528,"MaxQuant Score",48.2440000,0.8840000,,,,0.00038529999437742,-0.3480000
WGDSHSAAYSTLSDYQFARPK,fuc,S,357,true,"SPINDLY O-fucosylation",162,36739885,,,,,,,0.068999998271465,
WGDSHSAAYSTLSDYQFARPK,ph,S,359,true,"Tissue atlas Arabidopsis - ProteomicsDB",114,32188942,"MaxQuant score",74.2060000,0.8278880,,,,5.2162399697409E-6,
KLQQEWVVPLK,ac,K,379,false,"Quantitative Acetylproteomics",101,29440448,,,,,,,,
