Peptide,PTM,ModifiedAA,ModifiedPosition,PeptideUniqueToGene,ExperimentDesc,ExpID,PubmedID,ScoreType,IdentScore,LocProb,Log2FChange,PQ-val,QuantSig,PEP,MassErrorPPM
MDEEYEVIVLGTGLK,nta,M,1,false,"Characterization plant N-terminal acetylation",6,22223895,"MASCOT Score",98.4200000,,,,,,
MDEEYEVIVLGTGLK,nta,M,1,false,"Arabidopsis translation initiation landscape - NTA",167a,35069635,,,,,,,,
MDEEYEVIVLGTGLK,ph,Y,5,false,"Lateral root-induction - NAA vs control",106,23328941,"MASCOT Score",25.0000000,,,,,,
ECILSGLLSVDGVK,so,C,17,true,"S-sulfenylation site detection using YAP1C",110,32714340,,,,,,,,
NDYYGGESTSLNLNQLWKK,ub,K,53,false,"upl3 mutant / wildtype",168,35926874,"MaxQuant score",122.1400000,1.0000000,1.0676387,0.0721040,NO,4.4308101024987E-13,-0.0303450
VPATPMEALK,ph,T,121,false,"Tissue atlas Arabidopsis - ProteomicsDB",114,32188942,"MaxQuant score",100.3100000,1.0000000,,,,0.0011652699904516,
SSLMGIFEK,ph,S,129,true,"atm and atr DNA damage response",88,25561503,"MASCOT Score",45.0000000,0.9540000,,,,,-1.2800000
SSLMGIFEKR,ac,K,136,true,"Quantitative Acetylproteomics",101,29440448,,,,,,,,
FFSFVQEYDEKDPK,ub,K,152,true,"upl3 mutant / wildtype",168,35926874,"MaxQuant score",58.2680000,1.0000000,-1.0232698,,,0.00071344501338899,1.1915000
MKLYAESLAR,ub,K,209,false,"Arabidopsis ubiquitination COFRADIC",40,26744219,"MaxQuant Score",67.3340000,1.0000000,,,,0.00075569999171421,0.0810000
LSAVYGGTYMLNKPECK,so,C,256,false,"S-sulfenylation site detection using YAP1C",110,32714340,,,,,,,,
IVCDPSYLPNK,ox,C,283,true,"SPEAR - 50 mM H2O2 / mock",138b,34619326,,,,2.0431376,0.0365418,YES,,
IVCDPSYLPNK,sno,C,283,true,"Site-specific nitrosomeproteomic id - gsnor1-3",90a,25699590,XCorr,2.9254985,,,,,0.0075690001249313,-6.5703892
IVCDPSYLPNK,sno,C,283,true,"hot5-4 / wildtype, FAT-switch S-nitrosoproteome",169,37277371,,,,0.8202621,0.0020156,YES,,
IVCDPSYLPNKVR,so,C,283,true,"S-sulfenylation site detection using YAP1C",110,32714340,,,,,,,,
