Peptide,PTM,ModifiedAA,ModifiedPosition,PeptideUniqueToGene,ExperimentDesc,ExpID,PubmedID,ScoreType,IdentScore,LocProb,Log2FChange,PQ-val,QuantSig,PEP,MassErrorPPM
DSYGNKLDVPR,ub,K,85,true,"Arabidopsis ubiquitination COFRADIC",40,26744219,"MaxQuant Score",72.3400000,1.0000000,,,,0.00052499998128042,0.7790000
RKSPHSDLGITECK,ph,S,210,true,"Phospho cell culture sucrose/TOR",109,30833711,,,0.9996960,,,,,
RKSPHSDLGITECK,ph,S,210,true,"Tissue atlas Arabidopsis - ProteomicsDB",114,32188942,"MaxQuant score",79.7440000,0.9978440,,,,0.00038934199255891,
GAGSELSSSEAEAYHSNQPCSPR,ph,S,388,true,"Tissue atlas Arabidopsis - ProteomicsDB",114,32188942,"MaxQuant score",161.8800000,0.7939190,,,,2.6148397500117E-39,
GAGSELSSSEAEAYHSNQPCSPR,ph,S,393,true,"Phospho cell culture sucrose/TOR",109,30833711,,,0.9246410,,,,,
GAGSELSSSEAEAYHSNQPCSPR,ph,S,393,true,"Col-0 callus - FC Col-0 vs. Col-0 Xray",111a,31410901,,28.9000000,,1.0610767,0.0171333,YES,,1.8003251
GAGSELSSSEAEAYHSNQPCSPR,ph,S,393,true,"Col-0 X-ray callus - FC Col-0 vs. Col-0 Xray",111b,31410901,,28.9000000,,1.0610767,0.0171333,YES,,1.8003251
GAGSELSSSEAEAYHSNQPCSPR,ph,S,393,true,"atm callus - FC atm vs. atm Xray",111c,31410901,,28.9000000,,0.5004484,0.2723902,NO,,1.8003251
GAGSELSSSEAEAYHSNQPCSPR,ph,S,393,true,"atm-3 X-ray callus - FC atm vs. atm Xray",111d,31410901,,28.9000000,,0.5004484,0.2723902,NO,,1.8003251
GAGSELSSSEAEAYHSNQPCSPR,ph,S,393,true,"Tissue atlas Arabidopsis - ProteomicsDB",114,32188942,"MaxQuant score",255.2000000,0.9999990,,,,0,
SSTISSPEFIIDR,ph,T,402,true,"Tissue atlas Arabidopsis - ProteomicsDB",114,32188942,"MaxQuant score",104.1700000,0.8063370,,,,0.00049920100718737,
SSTISSPEFIIDR,ph,S,405,true,"Tissue atlas Arabidopsis - ProteomicsDB",114,32188942,"MaxQuant score",140.1000000,0.9808080,,,,1.3977200069348E-5,
ESTSYSESFK,ph,S,416,true,"Tissue atlas Arabidopsis - ProteomicsDB",114,32188942,"MaxQuant score",67.9990000,0.8559090,,,,0.0075856801122427,
ESTSYSESFK,ph,S,418,true,"Tissue atlas Arabidopsis - ProteomicsDB",114,32188942,"MaxQuant score",101.8900000,0.9429770,,,,0.0003801429993473,
SEVLSEQARSE,ph,S,450,true,"Tyrosine phosphorylation in Arabidopsis",59,18463617,"MASCOT Score",45.0000000,,,,,,-0.6090369
SEVLSEQARSE,ph,S,450,true,"atm and atr DNA damage response",88,25561503,"MASCOT Score",26.0000000,1.0000000,,,,,-0.5100000
SEVLSEQARSE,ph,S,450,true,"Phospho cell culture sucrose/TOR",109,30833711,,,1.0000000,,,,,
SEVLSEQARSE,ph,S,450,true,"Tissue atlas Arabidopsis - ProteomicsDB",114,32188942,"MaxQuant score",240.1800000,1.0000000,,,,0,
